data loggers
type: Concept
version info: 1
deprecated: false
definition: Electronic devices that record data over time or in relation to location either with a built-in instrument or sensor or via external instruments and sensors.
in scheme: current
in scheme: icos_instruments
notation: SDN:L05::DLOG
note: accepted
broader: ICAT04
broader: instrument type
narrower: TOOL1541
narrower: TOOL1922
narrower: TOOL1795
narrower: TOOL1523
narrower: TOOL1350
narrower: TOOL1817
narrower: TOOL1921
narrower: TOOL1988
narrower: TOOL1768
narrower: TOOL2014
narrower: TOOL1410
narrower: TOOL1184
narrower: TOOL1506
narrower: TOOL1966
narrower: TOOL1596
narrower: TOOL1842
narrower: TOOL1841
narrower: TOOL1510
narrower: TOOL1765
narrower: TOOL0306
narrower: TOOL1449
narrower: TOOL1901
narrower: TOOL1278
narrower: TOOL1718
narrower: TOOL1839
narrower: TOOL1183
narrower: TOOL1594
narrower: TOOL1840
narrower: TOOL1736
narrower: TOOL1651
narrower: TOOL1647
narrower: TOOL1648
narrower: TOOL1653
narrower: TOOL1797
narrower: TOOL1481
narrower: TOOL1341
narrower: TOOL1515
narrower: TOOL1448
narrower: TOOL1746
narrower: TOOL1430
narrower: TOOL1657
narrower: TOOL1301
narrower: TOOL1185
narrower: TOOL1551
narrower: TOOL1810
narrower: TOOL1794
narrower: TOOL1775
narrower: TOOL1992
narrower: TOOL1401
narrower: TOOL2089
in dataset: void
date: 2017-12-05 11:14:23.0
authored on: 2017-12-05 11:14:23.0
version: 1
has current version: http://vocab.nerc.ac.uk/collection/L05/current/DLOG/1/
modified: 2025-04-18T13:01:38

water pressure sensors_2
type: Concept
version info: 1
deprecated: false
definition: Sensors measuring hydrostatic pressure that are capable of withstanding the physical demands made by in-situ measurements in water bodies. Depending upon the mode of deployment they may measure sea level, waves, mooring performance or the depth of a profiling instrument.
in scheme: current
notation: SDN:L05::WPS
note: accepted
broader: ICAT04
broader: CLSS0002
broader: instrument type
broader: https://www.nodc.noaa.gov/cgi-bin/OAS/prd/insttype/details/207
broader: http://vocab.nerc.ac.uk/collection/D01/current/D0100002/
narrower: TOOL1523
narrower: TOOL1921
narrower: TOOL1474
narrower: TOOL1009
narrower: TOOL1397
narrower: TOOL1207
narrower: TOOL0838
narrower: TOOL0846
narrower: TOOL1612
narrower: TOOL1398
narrower: TOOL1475
narrower: TOOL0852
narrower: TOOL1010
narrower: TOOL0977
narrower: TOOL0839
narrower: TOOL2060
narrower: TOOL1827
narrower: TOOL0837
narrower: TOOL1357
narrower: TOOL1122
narrower: TOOL0596
narrower: TOOL1908
narrower: TOOL2059
narrower: TOOL0403
narrower: TOOL1616
narrower: TOOL0931
narrower: TOOL0475
narrower: TOOL1125
narrower: TOOL1302
narrower: TOOL1141
narrower: TOOL1275
narrower: TOOL1369
narrower: TOOL1787
narrower: TOOL1121
narrower: TOOL1267
narrower: TOOL1286
narrower: TOOL1406
narrower: TOOL1824
narrower: TOOL1116
narrower: TOOL1492
narrower: TOOL1599
narrower: TOOL1359
narrower: TOOL1458
narrower: TOOL1331
narrower: TOOL1476
narrower: TOOL1459
narrower: TOOL1470
narrower: TOOL1453
narrower: TOOL1450
narrower: TOOL1451
narrower: TOOL1232
narrower: TOOL1318
narrower: TOOL2030
narrower: TOOL1538
narrower: TOOL1695
narrower: TOOL1646
narrower: TOOL1600
narrower: TOOL1360
narrower: TOOL1456
narrower: TOOL1437
narrower: TOOL1323
narrower: TOOL1786
narrower: TOOL1393
narrower: TOOL0873
narrower: TOOL1457
narrower: TOOL1452
in dataset: void
date: 2015-02-11 09:24:01.0

radiometer
type: Concept
version info: 1
deprecated: false
definition: An instrument that measures the intensity of electromagnetic radiation.
notation: SDN:S04::S04302
note: accepted
broader: S0110
broader: instrument type
related: DWUV380A
related: TTWTIR01
related: CPHLUA01
related: UVRDZZ01
related: DWUV305A
related: DWUV325A
related: CPHLUB01
related: DWUV340A
in dataset: void
date: 2006-10-02 18:26:59.0
authored on: 2006-10-02 18:26:59.0
version: 1
has current version: http://vocab.nerc.ac.uk/collection/S04/current/S04302/1/
in scheme: icos_instruments
modified: 2024-10-07T13:42:11

soil moisture sensor
type: Sensor
type: Concept
broader: c 2f2d85d8
broader: instrument type
in scheme: icos_instruments
definition: A SOIL MOISTURE PROBE is a device that measures the total amount of water, including the water vapor, in unsaturated soil.
alternative label: Soil moisture probe
modified: 2025-04-04T11:10:54

Vaisala PMT16A
created: 2025-04-14T16:33:39
type: Concept
in scheme: icos_instruments
broader: Electronic barometer
definition: Atmospheric Pressure, Vaisala, PMT16A
modified: 2026-02-06T14:23:46

TEMP-Generic TC other types
definition: Temperature, Generic, Thermocouple other types (includes all the models corresponding to not listed types)
modified: 2025-04-11T15:48:54
type: Concept
in scheme: icos_instruments
broader: TEMP-TCouple
created: 2025-04-11T15:48:01
alternative label: Thermocouple - other types

TEMP-Generic TC type E
type: Concept
in scheme: icos_instruments
broader: TEMP-TCouple
created: 2025-04-11T15:49:12
alternative label: Thermocouple - type E
definition: Temperature, Generic, Thermocouple type E (includes all the models corresponding to type E)
modified: 2025-04-11T15:49:54

RAD_PAR-DeltaT BF5
type: Concept
created: 2024-07-01T10:13:57
in scheme: icos_instruments
broader: atmospheric radiometers
scope note: Output can be also provided as short-wave
definition: BF5 quantum sensor (PAR) produced by Delta T Devices
alternative label: Delta T Devices BF5 quantum sensor
modified: 2024-10-07T15:43:07

multi-sensor
type: Concept
broader: instrument type
created: 2024-10-09T11:04:18
definition: Instrument that includes more than one sensor for measurement.
in scheme: icos_instruments
modified: 2024-10-09T11:57:25

RAD_SW-K&Z CM21
type: Concept
created: 2024-07-01T10:20:49
in scheme: icos_instruments
broader: atmospheric radiometers
alternative label: Kipp & Zonen CM21 pyranometer
definition: CM21 pyranometer (short-wave ISO 9060:1990 secondary standard) produced by Kipp & Zonen
modified: 2024-10-07T15:47:38

RAD_4C-K&Z CNR4
type: Concept
created: 2024-07-01T10:21:46
in scheme: icos_instruments
broader: atmospheric radiometers
definition: CNR4 pyradiometer (short-wave ISO 9060:1990 second class and long-wave) produced by Kipp & Zonen
alternative label: Kipp & Zonen CNR4 pyradiometer
modified: 2024-10-07T15:41:44

RAD_PAR-LI-COR LI190
type: Concept
created: 2024-07-01T10:22:17
in scheme: icos_instruments
broader: atmospheric radiometers
scope note: For ICOS ERIC it includes the versions SA, SZ and SL
definition: LI-190 series quantum sensor (PAR) produced by LI-COR
alternative label: LI-COR LI-190 quantum sensor
modified: 2024-10-07T15:43:20

RAD_PAR-LI-COR LI190R
type: Concept
created: 2024-07-01T10:25:12
in scheme: icos_instruments
broader: atmospheric radiometers
definition: LI-190R quantum sensor (PAR) produced by LI-COR
alternative label: LI-COR LI-190R quantum sensor
modified: 2024-10-07T15:43:36

Vaisala PTU(x) series
type: Concept
created: 2024-07-01T10:27:38
in scheme: icos_instruments
broader: barometer
broader: humidity sensor
broader: temperature sensor
broader: multi-sensor
definition: Atmospheric Pressure, Air Relative Humidity and Temperature, Vaisala, PTU(x) (includes PTU300, PTU301, PTU303, PTU307 and PTU-Module on WXT520 and WXT530 series Weather Transmitter)
modified: 2026-02-06T16:13:22

RAD_LW-APO SI111
type: Concept
created: 2024-07-18T10:34:44
in scheme: icos_instruments
broader: atmospheric radiometers
alternative label: Apogee SI-111 radiometer
definition: SI-111 long-wave infrared radiometer produced by Apogee
modified: 2024-10-07T13:52:36

RAD_SW-APO SP110
type: Concept
created: 2024-07-18T10:35:26
in scheme: icos_instruments
broader: atmospheric radiometers
alternative label: Apogee SP-110 pyranometer
definition: SP-110 pyranometer (short-wave ISO 9060:1990 second class) produced by Apogee
modified: 2024-10-07T15:45:30

RAD_PAR-APO SQ1xx-2xx
type: Concept
created: 2024-07-18T11:07:39
in scheme: icos_instruments
broader: atmospheric radiometers
definition: SQ-100 and SQ-200 series quantum sensor (PAR) produced by Apogee
modified: 2024-10-08T10:00:22

RAD_PAR-APO SQ100X
type: Concept
created: 2024-07-18T11:08:40
in scheme: icos_instruments
broader: atmospheric radiometers
definition: SQ-100X series quantum sensor (PAR) produced by Apogee
alternative label: Apogee SQ-100X series quantum sensor
modified: 2024-10-07T15:42:58

RAD_PAR-APO SQ2xxX
type: Concept
created: 2024-07-18T11:09:11
in scheme: icos_instruments
broader: atmospheric radiometers
definition: SQ-200X series quantum sensor (PAR) produced by Apogee
scope note: For ICOS ERIC it includes the models SQ-202X, SQ-204X and SQ-205X
alternative label: Apogee SQ-200X series quantum sensor
modified: 2024-10-07T15:42:20

TEMP-Generic TC type J
type: Concept
in scheme: icos_instruments
broader: TEMP-TCouple
created: 2025-04-11T15:50:07
alternative label: Thermocouple - type J
definition: Temperature, Generic, Thermocouple type J (includes all the models corresponding to type J)
modified: 2025-04-11T15:50:43

RAD_PAR-APO SQ4xx
type: Concept
created: 2024-07-18T13:58:33
in scheme: icos_instruments
broader: atmospheric radiometers
scope note: For ICOS ERIC it includes the models SQ-420, SQ-421 and SQ-422
alternative label: Apogee SQ-400 series quantum sensor
definition: SQ-400 series quantum sensor (PAR) produced by Apogee
modified: 2024-10-08T10:09:15

RAD_PAR-APO SQ4xxX
type: Concept
created: 2024-07-18T13:59:43
in scheme: icos_instruments
broader: atmospheric radiometers
scope note: For ICOS ERIC it includes the models SQ-420X, SQ-421X and SQ-422X
definition: SQ-400X series quantum sensor (PAR) produced by Apogee
alternative label: Apogee SQ-400X series quantum sensor
modified: 2024-10-07T15:42:39

TEMP-Generic TC type K
type: Concept
in scheme: icos_instruments
broader: TEMP-TCouple
created: 2025-04-11T15:50:54
definition: Temperature, Generic, Thermocouple type K (includes all the models corresponding to type K)
alternative label: Thermocouple - type K
modified: 2025-04-11T15:51:27

RAD_PAR-APO SQ5xx
type: Concept
created: 2024-07-18T14:00:25
in scheme: icos_instruments
broader: atmospheric radiometers
definition: SQ-500 series quantum sensor (PAR) produced by Apogee
alternative label: Apogee SQ-500 series quantum sensor
modified: 2024-10-07T15:42:48

TEMP-Apogee ST-1x0
type: Concept
created: 2024-07-18T14:01:05
in scheme: icos_instruments
broader: temperature sensor
scope note: For ICOS ERIC it includes the thermistors Apogee ST-100, ST-110 and ST-150
modified: 2024-10-08T10:19:08

METEK Meteorologische Messtechnik GmbH
type: Collection
created: 2025-04-11T12:53:47
member: TEMP-Metek LTS 2000
alternative label: METEK
modified: 2025-04-11T13:24:04

TEMP-Apogee ST-x00
type: Concept
created: 2024-07-18T14:29:27
in scheme: icos_instruments
broader: TEMP-ElectResis
scope note: Temperature, Apogee, ST-1xx PRT family (includes ST-200 and ST-300)
modified: 2025-04-10T18:07:02

SA-ATI CATI/2
type: Concept
definition: LEAF_WET
in scheme: icos_instruments
editorial note: CONCETTO DA RIVEDERE
broader: sonic anemometer
created: 2024-07-18T14:30:15
modified: 2024-10-03T14:09:28

SA-ATI SATI A Style
type: Concept
definition: Three-dimensional ultrasonic anemometer of the SATI series with a non-orthogonal probe of type "A" produced by Applied Technologies
in scheme: icos_instruments
alternative label: Applied Technologies SATI A Style sonic anemometer
broader: sonic anemometer
created: 2024-07-18T16:09:25
modified: 2024-10-03T14:16:26

SA-ATI SATI K Style
type: Concept
definition: Three-dimensional ultrasonic anemometer of the SATI series with a three axis probe of type "K" produced by Applied Technologies
scope note: In ICOS this concept includes Applied Technologies Model No. SWS 211/3K
in scheme: icos_instruments
alternative label: Applied Technologies SATI K Style sonic anemometer
broader: sonic anemometer
created: 2024-07-18T16:09:56
modified: 2024-10-03T14:31:54

SA-ATI SPAS
type: Concept
in scheme: icos_instruments
alternative label: Applied Technologies SPAS sonic anemometer
broader: sonic anemometer
created: 2024-07-18T16:12:05
modified: 2024-10-03T14:26:58

SA-ATI Sx Style
type: Concept
definition: Three-dimensional ultrasonic anemometer of the SATI series with a single axis probe of type "Sx" produced by Applied Technologies
in scheme: icos_instruments
alternative label: Applied Technologies SATI Sx Style sonic anemometer
broader: sonic anemometer
created: 2024-07-18T16:12:31
modified: 2024-10-03T14:30:16

SA-ATI V Style
type: Concept
definition: Three-dimensional ultrasonic anemometer of the SATI series with a three axis probe of type "V" produced by Applied Technologies
in scheme: icos_instruments
alternative label: Applied Technologies SATI V Style sonic anemometer
broader: sonic anemometer
created: 2024-07-18T16:13:02
modified: 2024-10-03T14:31:38

SA-ATI Vx Style
type: Concept
definition: Three-dimensional ultrasonic anemometer of the SATI series with a three axis probe of type "Vx" produced by Applied Technologies
in scheme: icos_instruments
alternative label: Applied Technologies SATI Vx Style sonic anemometer
broader: sonic anemometer
created: 2024-07-18T16:13:36
modified: 2024-10-03T14:49:39

RHTEMP-Asair xM2xx5(A)
type: Concept
created: 2024-07-18T16:14:03
in scheme: icos_instruments
scope note: For ICOS ERIC it includes the Asair temperature and humidity sensors models AM2105A, AM2305, CM2315 and CM2105
broader: humidity sensor
broader: temperature sensor
change note: add multi-sensor as broader
modified: 2025-03-28T10:48:29

TEMP-Generic TC type N
type: Concept
in scheme: icos_instruments
broader: TEMP-TCouple
created: 2025-04-11T15:51:40
alternative label: Thermocouple - type N
definition: Temperature, Generic, Thermocouple type N (includes all the models corresponding to type N)
modified: 2025-04-11T15:52:13

Bosch BME280
type: Concept
created: 2024-07-18T16:16:28
in scheme: icos_instruments
broader: barometer
broader: humidity sensor
broader: temperature sensor
broader: multi-sensor
definition: Sensor measuring Atmospheric Pressure, Air Relative Humidity and Temperature, Bosch, BME280
modified: 2026-02-06T15:03:21

TEMP-Campbell 105E
type: Concept
created: 2024-07-18T16:28:03
broader: TEMP-TCouple
modified: 2025-04-11T16:22:18
in scheme: icos_instruments
alternative label: Campbell Scientific 105E-L temperature sensor

TEMP-Campbell 105T
type: Concept
created: 2024-07-26T13:19:55
broader: TEMP-TCouple
modified: 2025-04-11T16:21:31
in scheme: icos_instruments
alternative label: Campbell Scientific 105T-L temperature sensor

TEMP-Campbell CS10X
type: Concept
created: 2024-07-26T13:22:52
broader: TEMP-Thermis
modified: 2025-04-11T16:25:20
in scheme: icos_instruments
scope note: For ICOS ERIC it includes the Campbell Scientific thermistors 107, 108, 109, 107B, 108B, 107-LC, 108-LC. Are excluded the Campbell Scientific thermistors 105E and 105T which are defined elsewhere.

RAD_SW-Campbell ClimaVUE50
type: Concept
broader: Campbell Scientific ClimaVue50 weather sensor
modified: 2024-10-09T12:06:17
created: 2024-07-29T09:16:18
in scheme: icos_instruments
broader: atmospheric radiometers
alternative label: Pyranometer of ClimaVue 50 weather station
definition: Pyranometer (short-wave ISO 9060:1990 second class) of Campbell Scientific ClimaVue 50 weather station

TEMP-Generic TC type T
type: Concept
in scheme: icos_instruments
broader: TEMP-TCouple
created: 2025-04-11T15:52:25
definition: Temperature, Generic, Thermocouple type T (includes all the models corresponding to type T)
alternative label: Thermocouple - type T
modified: 2025-04-11T15:52:58

RH-Campbell ClimaVUE50
type: Concept
created: 2024-07-29T09:17:58
in scheme: icos_instruments
broader: Campbell Scientific ClimaVue50 weather sensor
definition: Campbell Scientific ClimaVUE 50 relative humidity sensor
modified: 2024-10-09T14:14:03

TEMP-Campbell ClimaVUE50
type: Concept
created: 2024-07-29T09:18:41
broader: TEMP-Thermis
modified: 2025-04-11T16:24:50
in scheme: icos_instruments
alternative label: Temperature sensor of ClimaVue 50 weather station
definition: Temperature sensor of Campbell Scientific ClimaVUE 50 weather station

WDWS-Campbell ClimaVUE50
type: Concept
created: 2024-07-29T09:20:25
in scheme: icos_instruments
broader: sonic anemometer
broader: Campbell Scientific ClimaVue50 weather sensor
alternative label: Campbell Scientific ClimaVUE 50 sonic anemometer
definition: Sonic anemometer measuring wind direction and wind speed of the Campbell Scientific ClimaVUE 50 weather station
modified: 2024-10-09T14:29:18

TEMP-Campbell CS2XX
type: Concept
created: 2024-07-29T09:47:18
in scheme: icos_instruments
scope note: For ICOS ERIC it includes Campbell Scientific CS225, CS230 and CS231 temperature sensors
broader: TEMP-IntegratedCircuit
modified: 2025-04-11T15:31:33

Vaisala PTB100 series
type: Concept
in scheme: icos_instruments
created: 2025-04-14T16:40:52
definition: Atmospheric Pressure, Vaisala, PTB100 series (includes PTB100A, PTB100B, PTB101C and PTB101B. The latter is also named CS105 by Campbell Scientific)
broader: Electronic barometer
modified: 2026-02-06T14:23:56

TEMP-Thermis
type: Concept
in scheme: icos_instruments
broader: temperature sensor
created: 2025-04-11T16:23:52
alternative label: Thermistor
modified: 2025-04-14T14:49:17

Aerodyne Research
type: Collection
member: Aerodyne Dual QCL
member: Aerodyne Mini QCL
created: 2024-05-30T16:00:52
modified: 2025-05-12T15:52:13

Campbell Scientific
type: Collection
member: TEMP-Campbell 105E
member: TEMP-Campbell 105T
member: TEMP-Campbell CS10X
member: RAD_SW-Campbell ClimaVUE50
member: RH-Campbell ClimaVUE50
member: TEMP-Campbell ClimaVUE50
member: WDWS-Campbell ClimaVUE50
member: TEMP-Campbell CS2XX
member: Campbell Scientific BaroVUE 10
member: Campbell Scientific ClimaVUE 50 Pressure component
member: PREC-Campbell ClimaVUE50
member: DL-Campbell CR1000
member: DL-Campbell CR1000X
member: DL-Campbell CR10X
member: DL-Campbell CR200X
member: DL-Campbell CR300
member: DL-Campbell CR3000
member: DL-Campbell CR310
member: DL-Campbell CR5000
member: DL-Campbell CR800
member: DL-Campbell CR850
member: DL-Campbell CR9000X
member: SA-Campbell CSAT-3
member: SA-Campbell CSAT-3A
member: SA-Campbell CSAT-3B
member: Campbell Scientific EC155
member: RAD_LW-Campbell IR120
member: TEMP-Cambpell PT100/3
member: SNOW-Campbell SnowVUE10
member: SNOW-Campbell SR50x
member: Campbell Scientific SR50A snow-depth sensor
member: Campbell Scientific SR50AT snow-depth sensor
member: Campbell Scientific SR50AH snow-depth sensor
member: Campbell Scientific SR50ATH snow-depth sensor
member: TEMP-Campbell TempVUE10
member: Campbell Scientific TGA100A
member: Campbell Scientific TGA200A
member: TEMP-Campbell SR50 AT
created: 2024-05-31T09:54:12
member: Campbell Scientific CS225 temperature sensor
member: Campbell Scientific CS230 temperature sensor
member: Campbell Scientific CS231 temperature sensor
member: Campbell Scientific 107 temperature probe
member: Campbell Scientific 107-LC temperature probe
member: Campbell Scientific 107B temperature probe
member: Campbell Scientific 108 temperature probe
member: Campbell Scientific 108-LC temperature probe
member: Campbell Scientific 108B temperature probe
member: Campbell Scientific 109 temperature probe
member: Campbell Scientific EC150
member: DL-Campbell CR6
member: Campbell Scientific ClimaVue50 weather sensor
member: SWC-Campbell CS6XX
member: Campbell Scientific CS615
member: Campbell Scientific CS616
member: Campbell Scientific CS625
member: SWCTEMP-Campbell CS65X
member: Campbell Scientific CS650
member: Campbell Scientific CS655
member: SWCTEMP-Campbell SoilVUE10
member: Campbell Scientific IRGASON
modified: 2025-05-12T18:50:07

Vaisala PTB330
type: Concept
in scheme: icos_instruments
created: 2025-04-14T16:45:37
broader: Electronic barometer
definition: Atmospheric Pressure, Vaisala, PTB330
modified: 2026-02-06T14:24:44

TEMP-Campbell SR50 AT
broader: TEMP-Thermis
scope note: Temperature, Campbell Scientific, SR50AT series thermistor (includes thermistor in SR50AT, SR50AT-316SS and SR50ATH)
modified: 2025-04-11T16:29:21
type: Concept
created: 2024-07-30T09:40:31
in scheme: icos_instruments
alternative label: Campbell Scientific SR50AT thermistors

Aerodyne Dual QCL
type: Concept
created: 2024-07-29T14:51:07
in scheme: icos_instruments
broader: Quantum Cascade Laser spectrometer (QCL)
definition: Gas Analyzer (Closed Path - Dual laser), Aerodyne, DualQCL
modified: 2025-07-08T20:00:10

Aerodyne Mini QCL
type: Concept
created: 2024-07-29T14:51:36
in scheme: icos_instruments
broader: Quantum Cascade Laser spectrometer (QCL)
definition: Gas Analyzer (Closed Path - Single Laser), Aerodyne, MiniQCL
modified: 2025-07-08T20:01:46

Bosch BMP380
type: Concept
created: 2024-07-29T14:53:00
broader: Bosch BMP series
in scheme: icos_instruments
definition: Atmospheric Pressure, Bosch, BMP series
modified: 2025-07-26T20:01:57

Bosch BMP388
type: Concept
created: 2024-07-29T14:53:14
in scheme: icos_instruments
broader: Bosch BMP series
definition: Atmospheric Pressure, Bosch, BMP series
modified: 2025-07-26T20:02:25

Bosch BMP390
type: Concept
created: 2024-07-29T14:53:28
in scheme: icos_instruments
broader: Bosch BMP series
definition: Atmospheric Pressure, Bosch, BMP series
modified: 2025-07-26T20:02:46

Bosch BMP580
type: Concept
created: 2024-07-29T14:53:43
in scheme: icos_instruments
broader: Bosch BMP series
definition: Atmospheric Pressure, Bosch, BMP series
modified: 2025-07-26T20:02:59

Bosch BMP581
type: Concept
created: 2024-07-29T14:53:59
in scheme: icos_instruments
broader: Bosch BMP series
definition: Atmospheric Pressure, Bosch, BMP series
modified: 2025-07-26T20:03:14

Campbell Scientific BaroVUE 10
type: Concept
created: 2024-07-29T14:54:13
in scheme: icos_instruments
broader: Electronic barometer
definition: Atmospheric Pressure, Campbell Scientific, BaroVUE 10
modified: 2025-07-26T20:08:51

Vaisala PTB100A
type: Concept
in scheme: icos_instruments
created: 2025-04-14T16:41:58
broader: Vaisala PTB100 series
modified: 2026-02-06T14:06:58

Campbell Scientific ClimaVUE 50 Pressure component
type: Concept
created: 2024-07-29T14:54:40
in scheme: icos_instruments
definition: Atmospheric Pressure, Campbell Scientific, ClimaVUE 50 weather station (air pressure sensor)
broader: Other technology barometer
modified: 2026-02-06T14:39:16

PREC-Campbell ClimaVUE50
type: Concept
created: 2024-07-29T14:55:19
in scheme: icos_instruments
broader: Campbell Scientific ClimaVue50 weather sensor
definition: Campbell Scientific ClimaVue 50 rain sensor
broader: RAIN-Other
modified: 2025-04-15T18:51:30

DL-Campbell CR1000
type: Concept
in scheme: icos_instruments
alternative label: Campbell Scientific CR1000 data logger
broader: data loggers
created: 2024-07-29T14:56:33
modified: 2024-10-03T12:47:43

DL-Campbell CR1000X
type: Concept
in scheme: icos_instruments
alternative label: Campbell Scientific CR1000X data logger
broader: data loggers
created: 2024-07-29T14:57:17
modified: 2024-10-03T12:48:41

DL-Campbell CR10X
type: Concept
in scheme: icos_instruments
alternative label: Campbell Scientific CR10X data logger
broader: data loggers
created: 2024-07-29T14:59:35
modified: 2024-10-03T12:36:13

DL-Campbell CR200X
type: Concept
in scheme: icos_instruments
alternative label: Campbell Scientific CR200X data logger
broader: data loggers
created: 2024-07-29T15:03:12
scope note: For ICOS ERIC it is also used when the data logger is provided by WeatherHawk.
modified: 2024-10-07T15:10:06

DL-Campbell CR300
type: Concept
in scheme: icos_instruments
alternative label: Campbell Scientific CR300 data logger
broader: data loggers
created: 2024-07-29T15:04:16
modified: 2024-10-03T12:42:47

DL-Campbell CR3000
type: Concept
in scheme: icos_instruments
alternative label: Campbell Scientific CR3000 data logger
broader: data loggers
created: 2024-07-29T15:04:41
modified: 2024-10-03T12:49:14

DL-Campbell CR310
type: Concept
in scheme: icos_instruments
alternative label: Campbell Scientific CR310 data logger
broader: data loggers
created: 2024-07-29T15:05:28
modified: 2024-10-03T12:43:45

DL-Campbell CR5000
type: Concept
in scheme: icos_instruments
alternative label: Campbell Scientific CR5000 data logger
broader: data loggers
created: 2024-07-29T15:05:51
modified: 2024-10-03T12:49:36

DL-Campbell CR800
type: Concept
in scheme: icos_instruments
alternative label: Campbell Scientific CR800 data logger
broader: data loggers
created: 2024-07-29T15:07:42
modified: 2024-10-03T12:46:18

DL-Campbell CR850
type: Concept
in scheme: icos_instruments
alternative label: Campbell Scientific CR850 data logger
broader: data loggers
created: 2024-07-29T15:08:07
modified: 2024-10-03T12:47:10

DL-Campbell CR9000X
type: Concept
in scheme: icos_instruments
alternative label: Campbell Scientific CR9000X data logger
broader: data loggers
created: 2024-07-29T15:08:32
modified: 2024-10-03T12:50:15

LI-COR LI-7200
type: Concept
created: 2024-07-29T15:09:11
in scheme: icos_instruments
scope note: The LI-7200 Enclosed CO2/H2O Analyzer is a high speed, high precision, non-dispersive infrared gas analyzer designed for applications that require fast and accurate CO2/H2O measurements. For eddy covariance applications, it mounts atop a flux tower or measurement platform and uses a short inlet tube co-located with the sample volume of the sonic anemometer.
broader: Closed-path nondispersive infrared gas analyzer (NDIR)
definition: LI-7200 closed-path gas analyser produced by LI-COR
modified: 2025-07-26T18:22:47

LI-COR LI-7200RS
type: Concept
created: 2024-07-29T15:09:34
in scheme: icos_instruments
scope note: The LI-7200RS is a closed path, non-dispersive infrared CO2/H2O analyzer designed for use in eddy covariance flux systems. The LI-7200RS computes dry mole fractions of CO2 or H2O in the air sample calculated using high speed measurements. These variables account for changes in air density due to the water vapor content, pressure, and temperature of the sample air. CO2 dry and H2O dry are computed as mole of gas per mole of dry air, and can be used for computing eddy covariance fluxes without the need for density corrections (Webb et al., 1980).
broader: Closed-path nondispersive infrared gas analyzer (NDIR)
definition: Gas Analyzer (Closed Path), LI-COR LI-7200RS
modified: 2025-07-26T18:23:10

LI-COR LI-7500RS
type: Concept
created: 2024-07-29T15:09:59
in scheme: icos_instruments
scope note: The LI-7500RS is a high performance, non-dispersive, open path infrared CO2/H2O analyzer designed for use in eddy covariance flux measurement systems.
broader: Open-path nondispersive infrared gas analyzer (NDIR)
definition: LI-7500RS open-path gas analyser produced by LI-COR
modified: 2025-07-26T18:41:10

instrument type
type: Concept
creator: https://orcid.org/0000-0002-3380-3470
definition: Terms used to classify groups of sensors, instruments, or samplers (collectors of water, PM, or air).
in scheme: icos_instruments
related match: current
top concept of: icos_instruments
modified: 2025-06-30T12:33:29

Bosch BMP280
type: Concept
created: 2024-07-30T08:50:44
in scheme: icos_instruments
definition: Atmospheric Pressure, Bosch, BMP series
broader: Bosch BMP series
modified: 2025-07-26T20:00:12

Bosch BMP384
type: Concept
created: 2024-07-30T08:51:01
in scheme: icos_instruments
broader: Bosch BMP series
definition: Atmospheric Pressure, Bosch, BMP series
modified: 2025-07-26T20:02:12

SA-Campbell CSAT-3
type: Concept
in scheme: icos_instruments
alternative label: Campbell Scientific CSAT3 sonic anemometer
broader: sonic anemometer
created: 2024-07-30T08:58:21
modified: 2024-10-03T14:53:35

SA-Campbell CSAT-3A
type: Concept
in scheme: icos_instruments
alternative label: Campbell Scientific CSAT3A sonic anemometer
broader: sonic anemometer
created: 2024-07-30T09:24:21
modified: 2024-10-03T14:54:11

SA-Campbell CSAT-3B
type: Concept
in scheme: icos_instruments
alternative label: Campbell Scientific CSAT3B sonic anemometer
broader: sonic anemometer
created: 2024-07-30T09:25:02
modified: 2024-10-03T14:54:32

Campbell Scientific EC150
type: Concept
created: 2024-07-30T09:26:32
in scheme: icos_instruments
scope note: The EC150 is an in situ, open-path, mid-infrared absorption gas analyzer that measures the absolute densities of carbon dioxide and water vapor. The EC150 was designed for open-path eddy covariance flux measurements as part of an open-path eddy covariance measurement system. It is most often used in conjunction with the CSAT3A sonic anemometer and thermometer, which measures orthogonal wind components along with sonically determined air temperature.
definition: EC150 open-path gas analyser produced by Campbell Scientific.
broader: Open-path infrared gas analyzers (IRGA)
modified: 2025-07-26T18:37:59

Campbell Scientific EC155
type: Concept
created: 2024-07-30T09:26:58
in scheme: icos_instruments
scope note: The EC155 is a closed-path, mid-infrared absorption analyzer that measures molar mixing ratios of carbon dioxide and water vapor, along with sample cell temperature and pressure. It has been designed specifically for eddy covariance flux measurements and may be used in conjunction with the CSAT3A 3D sonic anemometer head. The analyzer has a rugged, aerodynamic design with low power requirements, making it suitable for field applications.
broader: Closed-path nondispersive infrared gas analyzer (NDIR)
definition: EC155 closed-path gas analyser produced by Campbell Scientific
modified: 2025-07-26T18:26:10

RAD_LW-Campbell IR120
type: Concept
created: 2024-07-30T09:28:07
in scheme: icos_instruments
broader: atmospheric radiometers
alternative label: Campbell Scientific IR120 radiometer
definition: IR120 long-wave infrared radiometer produced by Campbell Scientific
modified: 2024-10-07T13:54:03

TEMP-DeltaT STx-05
type: Concept
in scheme: icos_instruments
broader: TEMP-Thermis
created: 2025-04-11T16:29:54
definition: Temperature, Delta-T Devices, STX-05 family (includes ST1-05, ST2-05, ST3-05, ST4-05)
alternative label: Temperature, Delta-T Devices, STX-05 family
modified: 2025-04-11T16:30:38

TEMP-Cambpell PT100/3
type: Concept
created: 2024-07-30T09:29:07
in scheme: icos_instruments
alternative label: Campbell Scientific PT100/3 temperature sensor
broader: TEMP-ElectResis
definition: Temperature, Campbell Scientific, PT100 Class 1/3 DIN
modified: 2025-04-10T18:17:27

SNOW-Campbell SnowVUE10
type: Concept
created: 2024-07-30T09:36:25
in scheme: icos_instruments
alternative label: Campbell Scientific SnowVue 10 snow-depth sensor
broader: SNOW-Acoustic
modified: 2025-04-17T18:14:14

SNOW-Campbell SR50x
type: Concept
created: 2024-07-30T09:37:22
in scheme: icos_instruments
alternative label: Campbell Scientific SR50 series snow-depth sensors
scope note: For ICOS ERIC it includes Campbell Scientific snow-depth sensor SR50A, SR50AT, SR50AH and SR50ATH
broader: SNOW-Acoustic
modified: 2025-04-17T18:15:18

Campbell Scientific SR50A snow-depth sensor
type: Concept
broader: SNOW-Campbell SR50x
created: 2024-07-30T09:37:59
in scheme: icos_instruments
modified: 2024-10-09T14:22:21

Campbell Scientific SR50AT snow-depth sensor
type: Concept
broader: SNOW-Campbell SR50x
created: 2024-07-30T09:38:07
in scheme: icos_instruments
modified: 2024-10-09T14:22:54

Campbell Scientific SR50AH snow-depth sensor
type: Concept
broader: SNOW-Campbell SR50x
created: 2024-07-30T09:38:14
in scheme: icos_instruments
modified: 2024-10-09T14:22:37

Campbell Scientific SR50ATH snow-depth sensor
type: Concept
broader: SNOW-Campbell SR50x
created: 2024-07-30T09:38:21
in scheme: icos_instruments
modified: 2024-10-09T14:23:11

TEMP-Campbell TempVUE10
type: Concept
created: 2024-07-30T09:38:39
in scheme: icos_instruments
broader: TEMP-ElectResis
definition: Temperature, Campbell Scientific, TempVUE 10
alternative label: Campbell Scientific TempVUE 10
modified: 2025-04-10T18:21:14

Campbell Scientific TGA100A
type: Concept
created: 2024-07-30T09:39:10
in scheme: icos_instruments
broader: Tunable Diode Laser Absorption Spectrometer (TDLAS)
scope note: The TGA100A Trace-Gas Analyzer measures trace-gas concentration in an air sample using tunable diode laser absorption spectroscopy (TDLAS). This technique provides high sensitivity, speed, and selectivity. The TGA100A is a rugged, portable instrument designed for use in the field. It can measure one of a large number of gases by choosing appropriate lasers and detectors. It incorporates several features that make it ideal for measuring fluxes of trace gases using gradient or eddy-covariance techniques.
definition: Gas Analyzer (Closed Path), Campbell Scientific, TGA100A
modified: 2025-07-22T19:48:01

Campbell Scientific TGA200A
type: Concept
created: 2024-07-30T09:39:39
in scheme: icos_instruments
scope note: The TGA200A Trace Gas Analyzer measures trace gas concentrations in an air sample using tunable-diode laser absorption spectroscopy (TDLAS). This technique provides high sensitivity, speed, and selectivity. Its simple design allows it to measure one of many gases by choosing an appropriate laser source. The TGA200A features a 1.5 m single-pass optical measurement system that uses a thermoelectrically cooled laser. The TGA200A is housed in a rugged environmental enclosure designed for use in demanding climates ranging from highlatitude boreal forests, permafrost, and tundra to agriculturally intensive mid-latitude regions and equatorial rainforests. Common applications include slow-gradient or high-speededdy-covariance measurements of nitrous oxide fluxes orcarbon fluxes in the form of methane, or isotopologs of carbondioxide in all global ecosystems
broader: Tunable Diode Laser Absorption Spectrometer (TDLAS)
definition: Gas Analyzer (Closed Path), Campbell Scientific, TGA200A
modified: 2025-07-22T19:49:05

Apogee Instruments
type: Collection
member: RAD_LW-APO SI111
member: RAD_SW-APO SP110
member: RAD_PAR-APO SQ1xx-2xx
member: RAD_PAR-APO SQ100X
member: RAD_PAR-APO SQ2xxX
member: RAD_PAR-APO SQ4xx
member: RAD_PAR-APO SQ4xxX
member: RAD_PAR-APO SQ5xx
member: TEMP-Apogee ST-1x0
member: TEMP-Apogee ST-x00
created: 2024-07-30T10:34:11
member: Apogee SQ-100 series quantum sensor
member: Apogee SQ-200 series quantum sensor
member: Apogee SQ-202X series quantum sensor
member: Apogee SQ-204X series quantum sensor
member: Apogee SQ-205X series quantum sensor
member: Apogee SQ-420 series quantum sensor
member: Apogee SQ-421 series quantum sensor
member: Apogee SQ-422 series quantum sensor
member: Apogee SQ-420X series quantum sensor
member: Apogee SQ-421X series quantum sensor
member: Apogee SQ-422X series quantum sensor
member: Apogee ST-100 thermistor
member: Apogee ST-110 thermistor
member: Apogee ST-150 thermistor
member: Apogee ST-200 thermistor
member: Apogee ST-300 thermistor
modified: 2025-04-10T18:10:31

Applied Technologies
type: Collection
member: SA-ATI CATI/2
member: SA-ATI SATI A Style
member: SA-ATI SATI K Style
member: SA-ATI SPAS
member: SA-ATI Sx Style
member: SA-ATI V Style
member: SA-ATI Vx Style
created: 2024-07-30T10:38:20
modified: 2024-10-02T10:57:13

ASAIR
type: Collection
member: RHTEMP-Asair xM2xx5(A)
created: 2024-07-30T10:40:04
member: Asair AM2105A temperature and humidity sensor
member: Asair AM2305 temperature and humidity sensor
member: Asair CM2105 temperature and humidity sensor
member: Asair CM2315 temperature and humidity sensor
modified: 2024-10-08T13:03:49

Baumer
type: Collection
created: 2024-07-30T11:08:44
modified: 2024-07-30T14:09:05

BD Sensors
type: Collection
created: 2024-07-30T11:09:00
modified: 2024-10-08T12:32:08

Bosch
type: Collection
member: Bosch BMP380
member: Bosch BMP388
member: Bosch BMP390
member: Bosch BMP580
member: Bosch BMP581
member: Bosch BMP280
member: Bosch BMP384
created: 2024-07-30T11:09:11
member: Bosch BMP series
member: Bosch BME280
modified: 2026-02-06T16:03:15

Delta-T Devices
type: Collection
member: RAD_PAR-DeltaT BF5
created: 2024-07-30T11:09:57
member: TEMP-DeltaT STx-05
member: Delta-T ST1-05
member: Delta-T ST2-05
member: Delta-T ST3-05
member: Delta-T ST4-05
member: SWC-DeltaT MLx(x)
member: Delta-T ML1
member: Delta-T ML2
member: Delta-T ML2x ThetaProbe
member: SWC-DeltaT PR2
member: Delta-T PR2/4
member: Delta-T PR2/6
member: SWC-DeltaT SM300
member: SWCTEMP-DeltaT ML3
member: SWCTEMP-DeltaT SM150T
member: PREC-DeltaT RG1
modified: 2025-04-16T20:18:26

Vaisala PTB100B
type: Concept
in scheme: icos_instruments
created: 2025-04-14T16:42:13
broader: Vaisala PTB100 series
modified: 2026-02-06T14:07:05

Kipp & Zonen
type: Collection
member: RAD_SW-K&Z CM21
member: RAD_4C-K&Z CNR4
created: 2024-07-30T11:10:07
modified: 2024-10-02T12:00:07

LI-COR
type: Collection
member: RAD_PAR-LI-COR LI190
member: RAD_PAR-LI-COR LI190R
member: LI-COR LI-7200
member: LI-COR LI-7200RS
member: LI-COR LI-7500RS
created: 2024-07-30T11:10:23
member: TEMP-LI-COR LI-7900-180
member: DL-LI-COR SFlux2
member: DL-LI-COR SFlux3
member: LI-COR LI-7000
member: LI-COR LI-6252
member: LI-COR LI-6262
member: LI-COR LI-7200-101 Flow Module
member: LI-COR LI-7200-102 Flow Module
member: LI-COR LI-7550 AIU
member: LI-COR LI-7500
member: LI-COR LI-7500A
member: LI-COR LI-7500DS
member: LI-COR LI-7700
member: LI-COR LI-800
member: LI-COR LI-820
member: LI-COR LI-830
member: LI-COR LI-840
member: LI-COR LI-840A
member: LI-COR LI-850
member: LI-COR LI-870
modified: 2025-07-26T19:52:14
member: LI-COR LI-8100
member: LI-COR LI-8100A

Vaisala
type: Collection
member: Vaisala PTU(x) series
created: 2024-07-30T11:10:40
member: Vaisala PTU300 pressure, humidity and temperature transmitter series
member: Vaisala PTU301 pressure, humidity and temperature transmitter series
member: Vaisala PTU303 pressure, humidity and temperature transmitter series
member: Vaisala PTU307 pressure, humidity and temperature transmitter series
member: Vaisala PMT16A
member: Vaisala PTB100 series
member: Vaisala PTB100A
member: Vaisala PTB100B
member: Vaisala PTB101B
member: Vaisala PTB101C
member: Vaisala PTB110 (or CS equivalent)
member: Vaisala PTB210
member: Vaisala PTB330
member: Vaisala FD12P
member: DL-Vaisala QML201
member: Vaisala GMP343
member: Vaisala PTU-Module on WXT520 and WXT530 series Weather Transmitter (excluding PTU30T)
member: Vaisala Weather Transmitter WXT520
member: Vaisala Weather Transmitter WXT530
modified: 2026-02-06T16:21:38

Vaisala PTU301 pressure, humidity and temperature transmitter series
type: Concept
broader: Vaisala PTU(x) series
created: 2024-10-02T12:13:32
in scheme: icos_instruments
modified: 2024-10-09T14:00:46

Vaisala PTU303 pressure, humidity and temperature transmitter series
type: Concept
broader: Vaisala PTU(x) series
created: 2024-10-02T12:13:43
in scheme: icos_instruments
modified: 2024-10-09T14:00:33

Vaisala PTU307 pressure, humidity and temperature transmitter series
type: Concept
broader: Vaisala PTU(x) series
created: 2024-10-02T12:13:53
in scheme: icos_instruments
modified: 2024-10-09T14:00:18

sonic anemometer
type: Concept
definition: A sonic anemometer is an anemometer that measures linear components of the wind vector by determining the effect of the wind on transit times of acoustic pulses transmitted in opposite directions across known paths; operates on the principle that the propagation velocity of a sound wave in a moving medium is equal to the velocity of sound with respect to the medium plus the velocity of the medium; an absolute instrument with a very short time constant and an absence of moving mechanical parts.
in scheme: icos_instruments
broader: instrument type
created: 2024-10-02T15:59:10
modified: 2024-10-03T13:50:39

icos_instruments
type: ConceptScheme
created: 2024-10-02T16:53:35
modified: 2025-07-07T15:48:43

weather station
broader: multi-sensor
type: Concept
creator: https://orcid.org/0000-0002-3380-3470
definition: Meteorological base parameter sensor combining observations of air temperature, pressure, humidity, wind speed, wind direction, and precipitation.
contributor: https://orcid.org/0000-0003-2042-9333
in scheme: icos_instruments
modified: 2025-04-14T17:16:29

Campbell Scientific ClimaVue50 weather sensor
type: Concept
in scheme: icos_instruments
broader: weather station
created: 2024-10-09T12:05:29

barometer
type: Concept
authored on: 2006-10-02 18:26:59.0
has current version: http://vocab.nerc.ac.uk/collection/S04/current/S04122/1/
version: 1
broader: S0110
broader: instrument type
notation: SDN:S04::S04122
date: 2006-10-02 18:26:59.0
version info: 1
note: accepted
deprecated: false
in dataset: void
definition: An instrument that measures atmospheric pressure.
in scheme: icos_instruments
modified: 2024-10-09T14:40:34

DL-Campbell CR6
type: Concept
in scheme: icos_instruments
broader: data loggers
created: 2024-10-04T11:41:09
alternative label: Campbell Scientific CR6 data logger
modified: 2024-10-09T15:04:09

gas analyzers
type: Concept
authored on: 2010-09-15 10:38:47.0
has current version: http://vocab.nerc.ac.uk/collection/L05/current/382/1/
version: 1
broader: ICAT04
broader: CLSS0002
broader: SDNKG01
broader: instrument type
notation: SDN:L05::382
in scheme: current
in scheme: icos_instruments
date: 2010-09-15 10:38:47.0
narrower: TOOL0878
narrower: TOOL1677
narrower: TOOL0724
narrower: TOOL0915
narrower: TOOL0229
narrower: TOOL2066
narrower: TOOL1918
narrower: TOOL2021
narrower: TOOL0085
narrower: TOOL1123
narrower: http://vocab.nerc.ac.uk/collection/W01/current/003/
narrower: TOOL0436
narrower: TOOL1780
narrower: TOOL1193
narrower: TOOL1104
narrower: TOOL0705
narrower: TOOL0913
narrower: TOOL0845
definition: In-situ instruments that can determine the proportion of one or more gaseous components of the atmosphere.
in dataset: void
deprecated: false
note: accepted
version info: 1
modified: 2025-05-23T15:46:17

Vaisala PTU300 pressure, humidity and temperature transmitter series
has version: http://vocab.nerc.ac.uk/collection/L22/current/TOOL0741/3/
has version: http://vocab.nerc.ac.uk/collection/L22/current/TOOL0741/1/
has version: http://vocab.nerc.ac.uk/collection/L22/current/TOOL0741/2/
authored on: 2024-08-22 15:12:07.0
type: Concept
has current version: http://vocab.nerc.ac.uk/collection/L22/current/TOOL0741/4/
related: ORG00323
definition: The Vaisala PTU300 is a series of air pressure, humidity and temperature transmitters comprising a base station and sensors that may be attached directly or on a remote probe suited to the application. The probes are designed for installation in various environments: PTU301 for laboratories, PTU303 for general use and PTU307 for outdoor and meteorological applications (warmed probe). All incorporate the Vaisala BAROCAP pressure sensor, a thermistor and the Vaisala HUMICAP humidity sensor giving pressure accurate to 0.1 - 0.3 hPa (depends upon sensor class), temperature accurate to 0.2 degC and humidity accurate to 1 %. The base station includes a graphical display giving continuous digital readout and keypad for operation control. Depending upon the options selected data may be logged internally (up 4 years) or transmitted via wired LAN, wireless LAN, USB, RS232 or RS485.
in dataset: void
deprecated: false
note: accepted
version info: 4
date: 2024-08-22 15:12:07.0
alternative label: Vaisala PTU300 series
in scheme: current
in scheme: icos_instruments
notation: SDN:L22::TOOL0741
broader: SDNKG17
broader: http://vocab.nerc.ac.uk/collection/L05/current/102/
broader: Vaisala PTU(x) series
version: 4
modified: 2024-10-09T13:59:19

atmospheric radiometers
authored on: 2008-01-10 16:22:48.0
has current version: http://vocab.nerc.ac.uk/collection/L05/current/308/1/
version: 1
broader: ICAT05
broader: http://vocab.nerc.ac.uk/collection/D01/current/D0100002/
broader: CLSS0002
broader: SDNKG01
notation: SDN:L05::308
in scheme: current
date: 2008-01-10 16:22:48.0
narrower: TOOL1061
narrower: TOOL1050
narrower: TOOL1512
narrower: TOOL1072
type: Concept
narrower: TOOL1873
narrower: TOOL1042
narrower: TOOL0695
narrower: TOOL1074
narrower: TOOL1066
narrower: TOOL1053
narrower: TOOL1037
narrower: TOOL0723
narrower: TOOL1060
narrower: TOOL1511
narrower: TOOL1085
narrower: TOOL1091
narrower: TOOL1365
narrower: TOOL1049
narrower: TOOL1035
narrower: TOOL1068
narrower: TOOL1557
narrower: TOOL1067
narrower: TOOL1734
narrower: TOOL1054
narrower: TOOL1073
narrower: TOOL1075
narrower: TOOL1065
narrower: TOOL1084
narrower: TOOL1052
narrower: TOOL0703
narrower: TOOL1090
narrower: TOOL0722
narrower: TOOL0912
narrower: TOOL2084
narrower: TOOL1559
narrower: TOOL1058
narrower: TOOL0702
narrower: TOOL2083
narrower: TOOL1672
narrower: TOOL1333
narrower: TOOL1332
narrower: TOOL1120
narrower: http://vocab.nerc.ac.uk/collection/W01/current/003/
narrower: TOOL1076
narrower: TOOL1063
version info: 1
related: ICESPD
related: ICEDIR
related: ICECOV
related: ICEDISP
related: ICETEMP
related: WTEMP
related: ICEBERG
related: ICEEDGE
related: ICETYPE
definition: Sensors that measure the intensity an nature of electromagnetic radiation in a manner optimised for the quantification of atmospheric phenomena.
in dataset: void
deprecated: false
note: accepted
in scheme: icos_instruments
broader: radiometer
modified: 2024-10-07T12:53:24

Rain Gauges
type: Sensor
type: Concept
definition: A RAIN GAUGE is an instrument that measures and records the level or levels of rain or precipitation.
broader: instrument type
in scheme: icos_instruments
modified: 2025-04-18T13:06:39

temperature sensor
type: Concept
authored on: 2017-10-25 10:49:33.0
has current version: http://vocab.nerc.ac.uk/collection/S04/current/S041129/1/
related: TVLTOT01
related: TMESOTAV
related: TMESOT01
definition: A type of temperature sensing device such as a resistance temperature detector, thermistor or thermocouple.
in dataset: void
deprecated: false
note: accepted
version info: 1
date: 2017-10-25 10:49:33.0
notation: SDN:S04::S041129
broader: S0110
broader: instrument type
version: 1
in scheme: icos_instruments
modified: 2024-10-07T16:16:24

Delta-T ST1-05
type: Concept
in scheme: icos_instruments
broader: TEMP-DeltaT STx-05
created: 2025-04-11T16:31:21

Delta-T ST2-05
type: Concept
in scheme: icos_instruments
broader: TEMP-DeltaT STx-05
created: 2025-04-11T16:31:49

Delta-T ST3-05
type: Concept
in scheme: icos_instruments
broader: TEMP-DeltaT STx-05
created: 2025-04-11T16:32:04

Delta-T ST4-05
type: Concept
in scheme: icos_instruments
broader: TEMP-DeltaT STx-05
created: 2025-04-11T16:32:15

Apogee SQ-100 series quantum sensor
type: Concept
in scheme: icos_instruments
broader: RAD_PAR-APO SQ1xx-2xx
created: 2024-10-08T10:05:10
modified: 2024-10-08T10:05:45

Apogee SQ-200 series quantum sensor
type: Concept
in scheme: icos_instruments
broader: RAD_PAR-APO SQ1xx-2xx
created: 2024-10-08T10:06:13

Apogee SQ-202X series quantum sensor
type: Concept
in scheme: icos_instruments
broader: RAD_PAR-APO SQ2xxX
created: 2024-10-08T10:07:22

Apogee SQ-204X series quantum sensor
type: Concept
in scheme: icos_instruments
broader: RAD_PAR-APO SQ2xxX
created: 2024-10-08T10:07:35

Apogee SQ-205X series quantum sensor
type: Concept
in scheme: icos_instruments
broader: RAD_PAR-APO SQ2xxX
created: 2024-10-08T10:07:50

Apogee SQ-420 series quantum sensor
type: Concept
in scheme: icos_instruments
broader: RAD_PAR-APO SQ4xx
created: 2024-10-08T10:09:50

Apogee SQ-421 series quantum sensor
type: Concept
in scheme: icos_instruments
broader: RAD_PAR-APO SQ4xx
created: 2024-10-08T10:10:02

Apogee SQ-422 series quantum sensor
type: Concept
in scheme: icos_instruments
broader: RAD_PAR-APO SQ4xx
created: 2024-10-08T10:10:14

Apogee SQ-420X series quantum sensor
type: Concept
in scheme: icos_instruments
broader: RAD_PAR-APO SQ4xxX
created: 2024-10-08T10:10:58

Apogee SQ-421X series quantum sensor
type: Concept
in scheme: icos_instruments
broader: RAD_PAR-APO SQ4xxX
created: 2024-10-08T10:11:11

Apogee SQ-422X series quantum sensor
type: Concept
in scheme: icos_instruments
broader: RAD_PAR-APO SQ4xxX
created: 2024-10-08T10:11:22

Apogee ST-100 thermistor
type: Concept
in scheme: icos_instruments
broader: TEMP-Apogee ST-1x0
created: 2024-10-08T10:20:37

Apogee ST-110 thermistor
type: Concept
in scheme: icos_instruments
broader: TEMP-Apogee ST-1x0
created: 2024-10-08T10:20:55

Apogee ST-150 thermistor
type: Concept
in scheme: icos_instruments
broader: TEMP-Apogee ST-1x0
created: 2024-10-08T10:21:10

Apogee ST-200 thermistor
type: Concept
in scheme: icos_instruments
broader: TEMP-Apogee ST-x00
created: 2024-10-08T10:27:00

Apogee ST-300 thermistor
type: Concept
in scheme: icos_instruments
broader: TEMP-Apogee ST-x00
created: 2024-10-08T10:27:18

Campbell Scientific CS225 temperature sensor
type: Concept
in scheme: icos_instruments
broader: TEMP-Campbell CS2XX
created: 2024-10-08T10:30:54

Campbell Scientific CS230 temperature sensor
type: Concept
in scheme: icos_instruments
broader: TEMP-Campbell CS2XX
created: 2024-10-08T10:31:10

Campbell Scientific CS231 temperature sensor
type: Concept
in scheme: icos_instruments
broader: TEMP-Campbell CS2XX
created: 2024-10-08T10:31:25

Campbell Scientific 107 temperature probe
type: Concept
in scheme: icos_instruments
broader: TEMP-Campbell CS10X
created: 2024-10-08T10:37:35
modified: 2024-10-08T10:38:03

Campbell Scientific 108 temperature probe
type: Concept
in scheme: icos_instruments
broader: TEMP-Campbell CS10X
created: 2024-10-08T10:38:43

Campbell Scientific 109 temperature probe
type: Concept
in scheme: icos_instruments
broader: TEMP-Campbell CS10X
created: 2024-10-08T10:39:04

Campbell Scientific 107B temperature probe
type: Concept
in scheme: icos_instruments
broader: TEMP-Campbell CS10X
created: 2024-10-08T10:39:19

Campbell Scientific 108B temperature probe
type: Concept
in scheme: icos_instruments
broader: TEMP-Campbell CS10X
created: 2024-10-08T10:39:30

Campbell Scientific 107-LC temperature probe
type: Concept
in scheme: icos_instruments
broader: TEMP-Campbell CS10X
created: 2024-10-08T10:39:46

Campbell Scientific 108-LC temperature probe
type: Concept
in scheme: icos_instruments
broader: TEMP-Campbell CS10X
created: 2024-10-08T10:40:04

Asair AM2105A temperature and humidity sensor
type: Concept
in scheme: icos_instruments
broader: RHTEMP-Asair xM2xx5(A)
created: 2024-10-08T13:02:09

Asair AM2305 temperature and humidity sensor
type: Concept
in scheme: icos_instruments
broader: RHTEMP-Asair xM2xx5(A)
created: 2024-10-08T13:02:34

Asair CM2315 temperature and humidity sensor
type: Concept
in scheme: icos_instruments
broader: RHTEMP-Asair xM2xx5(A)
created: 2024-10-08T13:02:57

Asair CM2105 temperature and humidity sensor
type: Concept
in scheme: icos_instruments
broader: RHTEMP-Asair xM2xx5(A)
created: 2024-10-08T13:03:16

humidity sensor
authored on: 2006-10-02 18:26:59.0
has current version: http://vocab.nerc.ac.uk/collection/S04/current/S04208/1/
type: Concept
related: CRELSS01
related: CRELSSMS
related: CRELSD01
definition: An instrument that directly measures the water content of the atmosphere.
in dataset: void
deprecated: false
note: accepted
version info: 1
date: 2006-10-02 18:26:59.0
notation: SDN:S04::S04208
broader: S0110
version: 1
in scheme: icos_instruments
broader: instrument type
modified: 2024-12-02T09:21:50

TEMP-Generic Thermistor
type: Concept
in scheme: icos_instruments
broader: TEMP-Thermis
created: 2025-04-11T16:33:55
alternative label: Temperature, Generic thermistor
modified: 2025-04-11T16:34:15

TEMP-Meter Atmos41
type: Concept
in scheme: icos_instruments
broader: TEMP-Thermis
created: 2025-04-11T16:34:26
alternative label: Atmos-41 Temperature component
definition: Temperature, Meter, Atmos41 weather station (Temperature sensor)
modified: 2025-04-11T16:36:57

Vaisala PTB101C
type: Concept
in scheme: icos_instruments
created: 2025-04-14T16:42:31
broader: Vaisala PTB100 series
modified: 2026-02-06T14:07:27

Meter Group
member: TEMP-Meter Atmos41
type: Collection
created: 2025-04-10T17:20:14
alternative label: Meter
member: SWC-Meter ECH2O XXXX
member: Meter ECH2O 10HS
member: Meter ECH2O EC-5
member: SWCTEMP-Meter ECH2O 5TX
member: Meter ECH2O 5TE
member: Meter ECH2O 5TM
member: TEMP-Meter TH3-x
member: TEMP-Meter TEROS06
member: Meter TH3-s
member: Meter TH3-v
member: Meter Atmos41 weather station
modified: 2025-04-15T18:57:07
member: PREC-Meter Atmos41

TEMP-LI-COR LI-7900-180
type: Concept
in scheme: icos_instruments
broader: TEMP-Thermis
created: 2025-04-11T16:38:08
definition: Temperature, LI-COR, LI-7900-180
modified: 2025-04-11T16:39:54

SWC-FDR
type: Concept
in scheme: icos_instruments
broader: soil moisture sensor
created: 2025-04-04T11:39:09
alternative label: soil water content Frequency domain reflectometry
definition: Controlled vocabulary for International BADM, for soil sensors based on frequency domain reflectometry method
modified: 2025-05-02T12:43:05

TEMP-WeatherHawk 610
type: Concept
in scheme: icos_instruments
broader: TEMP-Thermis
created: 2025-04-11T16:40:57
definition: Temperature, WeatherHawk, 610 weather station (Temperature sensor)
modified: 2025-04-11T16:42:03

WeatherHawk
type: Collection
created: 2025-04-11T16:44:45
member: TEMP-WeatherHawk 610
member: WeatherHawk WeatherHawk 610 Pressure component
member: WeatherHawk 610 weather station
modified: 2025-04-15T19:11:52
member: PREC-WeatherHawk 610

SWC-Campbell CS6XX
type: Concept
in scheme: icos_instruments
broader: SWC-FDR
created: 2025-04-08T11:28:31
alternative label: Campbell Scientifc, CS6XX FDR family, soil water content sensor
definition: ICOS BADM shortname for Campbell Scientifc CS6XX FDR family (includes CS615, CS616, CS625), excluding CS650 and CS655
modified: 2025-05-02T17:13:50

TEMP-ElectResis
alternative label: Electrical resistance thermometer
modified: 2025-04-14T14:47:54
type: Concept
in scheme: icos_instruments
broader: temperature sensor
created: 2025-04-10T18:02:36
definition: Electrical resistance thermometer

Campbell Scientific CS615
type: Concept
in scheme: icos_instruments
created: 2025-04-08T11:29:06
broader: SWC-Campbell CS6XX
scope note: ICOS BADM: SWC-Campbell CS6XX
definition: BADM Standard shortname: SWC-FDR
definition: BADM ICOS shortname: SWC-Campbell CS6XX
modified: 2025-05-02T17:11:13

Campbell Scientific CS616
type: Concept
in scheme: icos_instruments
broader: SWC-Campbell CS6XX
created: 2025-04-08T11:29:18
alternative label: Campbell Scientific CS616 soil water content sensor
modified: 2025-04-08T16:10:16

TEMP-TCouple
alternative label: Thermocouple
modified: 2025-04-14T14:48:55
type: Concept
in scheme: icos_instruments
broader: temperature sensor
created: 2025-04-11T15:47:26

Vaisala PTB101B
type: Concept
in scheme: icos_instruments
created: 2025-04-14T16:42:49
broader: Vaisala PTB100 series
modified: 2026-02-06T14:07:12

SWC-Other
alternative label: Soil Water Content - Other
modified: 2025-04-14T14:51:21
type: Concept
in scheme: icos_instruments
broader: soil moisture sensor
created: 2025-04-08T16:25:44

SWC-TDR
alternative label: soil water content Time domain reflectometry
modified: 2025-04-14T14:51:52
type: Concept
in scheme: icos_instruments
broader: soil moisture sensor
created: 2025-04-08T15:35:55
definition: soil sensor based on time domain reflectometry method

Campbell Scientific CS625
type: Concept
in scheme: icos_instruments
broader: SWC-Campbell CS6XX
created: 2025-04-08T13:19:44
alternative label: Campbell Scientific CS625 soil water content sensor
modified: 2025-04-08T16:10:30

CRESSTO SPA series
type: Concept
in scheme: icos_instruments
created: 2025-04-14T15:04:24
definition: Atmospheric Pressure, CRESSTO, SPA series (includes all the allowed combinations of letters and ciphers in the product code relative to multiplicand (1|3), accuracy (1|2), pressure connection (R|V|N|M|O|B), electrical connection (2|5), analogue electrical output (U), digital electrical output (A|B|C|[none]), display (D|[none]), memory (M|[none]), switch (S|[none]))
broader: Electronic barometer
modified: 2025-07-01T16:45:38

SWC-DeltaT MLx(x)
type: Concept
in scheme: icos_instruments
broader: SWC-FDR
created: 2025-04-08T14:23:40
definition: Soil Water Content, Delta-T Devices, ML ThetaProbe family (includes ML1, ML2, ML2x)
alternative label: Delta-T Devices, ML ThetaProbe family, soil water content sensor
modified: 2025-04-08T14:33:20

Delta-T ML1
type: Concept
in scheme: icos_instruments
broader: SWC-DeltaT MLx(x)
created: 2025-04-08T14:24:09
alternative label: Delta-T ML1, soil water content
modified: 2025-04-08T14:36:49

Vaisala PTB110 (or CS equivalent)
type: Concept
in scheme: icos_instruments
created: 2025-04-14T16:43:18
definition: Atmospheric Pressure, Vaisala, PTB110 (also named CS106)
broader: Electronic barometer
modified: 2026-02-06T14:24:27

Delta Ohm HD9408T BARO
type: Concept
in scheme: icos_instruments
created: 2025-04-14T15:06:04
broader: Electronic barometer
definition: Atmospheric pressure, DeltaOhm, HD9X08T(R)
modified: 2026-02-06T12:32:06

Delta-T ML2
type: Concept
in scheme: icos_instruments
broader: SWC-DeltaT MLx(x)
created: 2025-04-08T14:26:40
alternative label: Delta-T ML2, soil water content sensor
modified: 2025-04-08T14:35:53

Delta-T ML2x ThetaProbe
type: Concept
in scheme: icos_instruments
broader: SWC-DeltaT MLx(x)
created: 2025-04-08T14:27:06
alternative label: Delta-T ML2x ThetaProbe, soil water content sensor
modified: 2025-04-08T14:37:29

CRESSTO
type: Collection
created: 2025-04-14T15:07:32
member: CRESSTO SPA series
modified: 2025-04-14T15:09:30

SWC-DeltaT PR2
type: Concept
in scheme: icos_instruments
broader: SWC-FDR
created: 2025-04-08T14:37:45
alternative label: Delta-T Devices, PR2 probe, soil water content sensor
definition: Soil Water Content, Delta-T Devices, PR2 probe (includes PR2/4 and PR2/6)
modified: 2025-04-08T14:39:46

Delta-T PR2/4
type: Concept
in scheme: icos_instruments
broader: SWC-DeltaT PR2
created: 2025-04-08T14:39:26
alternative label: Delta-T Devices, PR2 probe, soil water content
definition: Delta-T PR2/4 model, measures soil water content at 4 depths down to 40 cm
modified: 2025-04-08T14:47:34

Delta Ohm
type: Collection
created: 2025-04-14T15:10:46
member: Delta Ohm HD9408T BARO
member: Delta Ohm HD9408TR BARO
modified: 2026-02-06T12:36:26
member: Delta Ohm HD9908T BARO

Delta-T PR2/6
type: Concept
in scheme: icos_instruments
broader: SWC-DeltaT PR2
created: 2025-04-08T14:45:15
alternative label: Delta-T Devices, PR2 probe, soil water content
definition: Delta-T PR2/6 measures soil water content at 6 depths down to 100 cm
modified: 2025-04-08T14:47:10

SWC-DeltaT SM300
type: Concept
in scheme: icos_instruments
broader: SWC-FDR
created: 2025-04-08T14:48:22
definition: Soil Water Content, Delta-T Devices, SM300
alternative label: Delta-T SM300, soil water content sensor
modified: 2025-04-08T14:50:01

SWC-Meter ECH2O XXXX
type: Concept
in scheme: icos_instruments
broader: SWC-FDR
created: 2025-04-08T14:50:27
definition: Soil Water Content, Meter, ECH2O SWC (includes ECH2O EC-5 and ECH2O 10HS), excluding ECH2O 5TE and ECH2O 5TM
alternative label: Meter ECH2O family, soil water content sensor
modified: 2025-04-08T14:56:44

Druck DPI 260
type: Concept
in scheme: icos_instruments
created: 2025-04-14T15:14:52
broader: Druck DPI 26x series
modified: 2026-02-06T12:44:37

Meter ECH2O EC-5
type: Concept
in scheme: icos_instruments
broader: SWC-Meter ECH2O XXXX
created: 2025-04-08T14:55:56
alternative label: Meter ECH2O EC-5, soil water content sensor
modified: 2025-04-08T14:56:25

Meter ECH2O 10HS
type: Concept
in scheme: icos_instruments
broader: SWC-Meter ECH2O XXXX
created: 2025-04-08T14:57:13
alternative label: Meter ECH2O 10HS, soil water content sensor
modified: 2025-04-08T14:57:46

SWC-Sentek EnviroSCAN
type: Concept
in scheme: icos_instruments
broader: SWC-FDR
created: 2025-04-08T14:58:06
definition: Soil Water Content, Sentek, EnviroSCAN
alternative label: Sentek EnviroSCAN, soil water content sensor
modified: 2025-04-08T14:59:14

SWCTEMP-Campbell CS65X
type: Concept
in scheme: icos_instruments
broader: SWC-FDR
created: 2025-04-08T15:02:20
definition: Soil Water Content and Temperature, Campbell Scientific, CS650 and CS655 FDR
alternative label: Campbell Scientific CS65X, soil water content and soil temperature FDR sensor
broader: MULTI-Meteo
modified: 2025-04-10T17:06:37

MULTI-Meteo
type: Concept
in scheme: icos_instruments
broader: multi-sensor
created: 2025-04-08T15:06:52

Druck DPI 261
type: Concept
in scheme: icos_instruments
created: 2025-04-14T15:15:06
broader: Druck DPI 26x series
modified: 2026-02-06T12:44:54

Campbell Scientific CS655
type: Concept
in scheme: icos_instruments
broader: SWCTEMP-Campbell CS65X
created: 2025-04-08T15:15:53
alternative label: Campbell Scientific CS655, soil water content and temperature
modified: 2025-04-08T16:11:25

Druck DPI 262
type: Concept
in scheme: icos_instruments
created: 2025-04-14T15:15:33
broader: Druck DPI 26x series
modified: 2026-02-06T12:45:14

Campbell Scientific CS650
type: Concept
in scheme: icos_instruments
broader: SWCTEMP-Campbell CS65X
created: 2025-04-08T15:16:52
alternative label: Campbell Scientific CS655, soil water content and temperature
modified: 2025-04-08T16:11:13

Druck DPI 265
type: Concept
in scheme: icos_instruments
created: 2025-04-14T15:15:47
broader: Druck DPI 26x series
modified: 2026-02-06T12:45:25

SWCTEMP-Campbell SoilVUE10
type: Concept
in scheme: icos_instruments
broader: SWC-TDR
created: 2025-04-08T15:37:06
definition: Soil Water Content and Temperature, Campbell Scientific, SoilVUE10 probe
alternative label: Campbell Scientific SoilVUE 10 probe, soil water content and temperature sensor
broader: MULTI-Meteo
modified: 2025-04-10T17:06:05

Druck DPI 266
type: Concept
in scheme: icos_instruments
created: 2025-04-14T15:16:05
broader: Druck DPI 26x series
modified: 2026-02-06T12:45:42

SWCTEMP-DeltaT ML3
type: Concept
in scheme: icos_instruments
broader: SWC-FDR
created: 2025-04-08T15:43:02
broader: MULTI-Meteo
alternative label: Delta-T ML3 ThetaProbe, soil water content and temperature sensor
definition: Soil Water Content and Temperature, Delta-T Devices, ML3 ThetaProbe
modified: 2025-04-10T17:06:32

SWCTEMP-DeltaT SM150T
type: Concept
in scheme: icos_instruments
broader: SWC-FDR
created: 2025-04-08T16:03:13
broader: MULTI-Meteo
alternative label: Delta-T SM150T, soil water content and temperature sensor
definition: Soil Water Content and Temperature, Delta-T Devices, SM150T
modified: 2025-04-10T17:06:28

Druck DPI 267
type: Concept
in scheme: icos_instruments
created: 2025-04-14T15:16:19
broader: Druck DPI 26x series
modified: 2026-02-06T12:45:59

Druck RPT410F
type: Concept
in scheme: icos_instruments
created: 2025-04-14T15:16:32
definition: Atmospheric Pressure, GE Druck, RPT410F (also named CS115)
broader: Electronic barometer
modified: 2026-02-06T12:48:43

SWCTEMP-IMKO Trime-PICO XX
type: Concept
in scheme: icos_instruments
broader: SWC-TDR
created: 2025-04-08T16:14:16
definition: Soil Water Content and Temperature, IMKO, Trime-PICO TDR (includes Trime-PICO 32 and Trime-PICO 64)
broader: MULTI-Meteo
alternative label: IMKO Trime-PICO TDR, Soil Water Content and Temperature sensor
modified: 2025-04-10T17:05:59

IMKO Trime-PICO 32
type: Concept
in scheme: icos_instruments
broader: SWCTEMP-IMKO Trime-PICO XX
created: 2025-04-08T16:17:34
alternative label: IMKO Trime-PICO 32, soil water content and temperature sensor
modified: 2025-04-08T16:18:25

IMKO Trime-PICO 64
type: Concept
in scheme: icos_instruments
broader: SWCTEMP-IMKO Trime-PICO XX
created: 2025-04-08T16:18:50
alternative label: IMKO Trime-PICO 64, soil water content and temperature sensor
modified: 2025-04-08T16:19:10

SWCTEMP-Meter ECH2O 5TX
type: Concept
in scheme: icos_instruments
broader: SWC-FDR
created: 2025-04-08T16:20:33
broader: MULTI-Meteo
definition: Soil Water Content and Temperature, Meter, ECH2O 5TX (includes ECH2O 5TE, ECH2O 5TM)
alternative label: Meter ECH2O 5TX family, soil water content and temperature sensor
modified: 2025-04-10T17:06:23

Meter ECH2O 5TM
type: Concept
in scheme: icos_instruments
broader: SWCTEMP-Meter ECH2O 5TX
created: 2025-04-08T16:22:24
alternative label: Meter ECH2O 5TM, soil water content and temperature sensor
modified: 2025-04-08T16:23:38

Meter ECH2O 5TE
type: Concept
in scheme: icos_instruments
broader: SWCTEMP-Meter ECH2O 5TX
created: 2025-04-08T16:22:36
alternative label: Meter ECH2O 5TE, soil water content and temperature sensor
modified: 2025-04-08T16:23:57

Druck Incorporated
type: Collection
created: 2025-04-14T15:21:43
member: Druck DPI 260
member: Druck DPI 261
member: Druck DPI 262
member: Druck DPI 265
member: Druck DPI 266
modified: 2025-04-14T15:22:13
member: Druck DPI 267
member: Druck RPT410F

SWCTEMP-Stevens Hydraprobe
type: Concept
in scheme: icos_instruments
broader: SWC-Other
created: 2025-04-08T16:25:58
definition: Soil Water Content and Temperature, Stevens, Hydraprobe. based on dielectric impedance measurement principle, it differs from TDR, capacitance, and frequency soil sensors by taking into account the energy storage and energy loss across the soil area using a 50 MHz radio frequency wave.
alternative label: Stevens Hydraprobe, Soil Water Content and Temperature sensor
broader: MULTI-Meteo
modified: 2025-04-10T17:06:17

SWCTEMP-Truebner SMT100
type: Concept
in scheme: icos_instruments
broader: SWC-Other
created: 2025-04-08T16:33:02
definition: Truebner SMT100 is a maintenance free capacitive sensor based on the TDT (time domain transmission) - soil water content and temperature sensor
alternative label: Truebner SMT100, soil water content and temperature sensor
broader: MULTI-Meteo
modified: 2025-04-10T17:06:12

soil heat flux sensor
type: Concept
in scheme: icos_instruments
broader: instrument type
created: 2025-04-08T17:02:31
definition: sensor for measuring soil heat flux, typically for energy-balance or Bowen-ratio flux systems
modified: 2025-04-08T17:11:10

SOIL_H-Plate
type: Concept
in scheme: icos_instruments
broader: soil heat flux sensor
created: 2025-04-08T17:02:50
definition: Soil Heat Flux sensor
modified: 2025-04-08T17:14:13

SOIL_H-Plate_AUTO
type: Concept
in scheme: icos_instruments
broader: soil heat flux sensor
created: 2025-04-08T17:03:00
definition: Soil Heat Flux sensor with autocalibration
modified: 2025-04-08T17:12:28

SOIL_H-Hukseflux HFP01
type: Concept
in scheme: icos_instruments
broader: SOIL_H-Plate
created: 2025-04-08T17:03:22
alternative label: Hukseflux HFP01, soil heat flux sensor
modified: 2025-04-10T18:23:30

SOIL_H-RIMCO HP3/CN3
type: Concept
in scheme: icos_instruments
broader: SOIL_H-Plate
created: 2025-04-08T17:03:42
alternative label: RIMCO HP3/CN3, soil heat flux plate sensor
modified: 2025-04-08T17:15:20

First Sensor 144SC0811BARO
type: Concept
in scheme: icos_instruments
created: 2025-04-14T15:28:21
definition: Atmospheric Pressure, First Sensor, 144SC0811BARO
broader: Electronic barometer
modified: 2026-02-06T12:54:56

SOIL_H-Hukseflux HFP01SC
type: Concept
in scheme: icos_instruments
broader: SOIL_H-Plate_AUTO
created: 2025-04-08T17:12:45
alternative label: Hukseflux HFP01SC, soil heat flux sensor, autocalibrated
modified: 2025-04-08T17:13:29

First Sensor
type: Collection
created: 2025-04-14T15:54:15
member: First Sensor 144SC0811BARO
member: First Sensor 144SC1216BARO
modified: 2026-02-06T13:05:58

Hukseflux
type: Collection
created: 2025-04-10T11:35:49
member: SOIL_H-Hukseflux HFP01
member: SOIL_H-Hukseflux HFP01SC
modified: 2025-04-10T14:46:29

Intersema MS554XX series
type: Concept
in scheme: icos_instruments
created: 2025-04-14T16:00:45
broader: Electronic barometer
modified: 2025-07-03T16:26:02

Intersema MS5540C
type: Concept
in scheme: icos_instruments
created: 2025-04-14T16:01:07
broader: Electronic barometer
modified: 2025-07-03T16:26:02

Sentek Technologies
type: Collection
created: 2025-04-10T17:32:33
alternative label: Sentek
member: SWC-Sentek EnviroSCAN
modified: 2025-04-10T17:35:25

Stevens Water Monitoring Systems
type: Collection
created: 2025-04-10T17:37:06
alternative label: Stevens
member: SWCTEMP-Stevens Hydraprobe
modified: 2025-04-10T17:39:49

Truebner
type: Collection
created: 2025-04-10T17:40:38
member: SWCTEMP-Truebner SMT100
modified: 2025-04-10T17:44:17

IMKO
type: Collection
created: 2025-04-10T17:43:56
member: SWCTEMP-IMKO Trime-PICO XX
modified: 2025-04-10T17:50:12

RIMCO
type: Collection
created: 2025-04-10T17:56:58
member: SOIL_H-RIMCO HP3/CN3
modified: 2025-04-10T17:57:36

Intersema Sensoric SA
type: Collection
created: 2025-04-14T16:03:16
modified: 2025-04-14T16:14:49
member: Intersema MS554XX series
member: Intersema MS5540C

Keller PAA33x
type: Concept
in scheme: icos_instruments
created: 2025-04-14T16:15:16
alternative label: Atmospheric Pressure, Keller, PAA-33X
broader: Electronic barometer
modified: 2026-02-06T13:17:15

TEMP-Fischer PT100 431100
type: Concept
in scheme: icos_instruments
broader: TEMP-ElectResis
created: 2025-04-11T12:38:23
definition: Temperature, Fischer, PT100 Class 1/3 DIN
alternative label: Temperature, Fischer, PT100 1/3 DIN 431100
modified: 2025-04-11T12:41:13

KELLER Druckmesstechnik AG
type: Collection
created: 2025-04-14T16:15:57
member: Keller PAA33x
modified: 2025-04-14T16:20:11

Fischer
type: Collection
created: 2025-04-11T12:42:58
member: TEMP-Fischer PT100 431100
alternative label: Feingerätebau K. Fischer GmbH
modified: 2025-04-11T12:50:02

TEMP-Metek LTS 2000
type: Concept
in scheme: icos_instruments
broader: TEMP-ElectResis
created: 2025-04-11T12:52:05
definition: Temperature, Metek, LTS 2000 (previously from Theodor Friedrichs & Co., includes also the version modified by Eigenbrodt)
alternative label: Temperature, Metek, LTS 2000
modified: 2025-04-11T12:52:50

Vaisala PTB210
type: Concept
in scheme: icos_instruments
created: 2025-04-14T16:44:32
broader: Electronic barometer
definition: Atmospheric Pressure, Vaisala, PTB210
modified: 2026-02-06T14:24:35

TEMP-MicroStep PT100
type: Concept
in scheme: icos_instruments
broader: TEMP-ElectResis
created: 2025-04-11T13:04:02
alternative label: Temperature, MicroStep-MIS, PT100
modified: 2025-04-11T13:04:25

TEMP-MicroStep PT100D
type: Concept
in scheme: icos_instruments
broader: TEMP-ElectResis
created: 2025-04-11T13:04:54
alternative label: Temperature, MicroStep-MIS, PT100D
modified: 2025-04-11T13:05:22

TEMP-MicroStep TPP
type: Concept
in scheme: icos_instruments
broader: TEMP-ElectResis
created: 2025-04-11T13:05:45
alternative label: Temperature, MicroStep-MIS, TPP probe
modified: 2025-04-11T13:06:41

Setra 270 (and CS equivalent)
type: Concept
in scheme: icos_instruments
created: 2025-04-14T16:24:30
definition: Atmospheric Pressure, Setra, 270 (also named SBP270 from Campbell)
alternative label: Atmospheric Pressure, Setra, 270
broader: Electronic barometer
modified: 2026-02-06T13:18:39

TEMP-MicroStep TPS Class 1/10 DIN
type: Concept
in scheme: icos_instruments
broader: TEMP-ElectResis
created: 2025-04-11T13:06:58
alternative label: Temperature, MicroStep-MIS, TPS probe Class 1/10 DIN
modified: 2025-04-11T13:07:15

TEMP-MicroStep TPS Class 1/3 DIN
type: Concept
in scheme: icos_instruments
broader: TEMP-ElectResis
created: 2025-04-11T13:07:30
alternative label: Temperature, MicroStep-MIS, TPS probe Class 1/3 DIN
modified: 2025-04-11T13:07:52

TEMP-MicroStep TPS Class 1/5 DIN
type: Concept
in scheme: icos_instruments
broader: TEMP-ElectResis
created: 2025-04-11T13:08:12
alternative label: Temperature, MicroStep-MIS, TPS probe Class 1/5 DIN
modified: 2025-04-11T13:08:31

MicroStep-MIS
type: Collection
created: 2025-04-11T13:09:58
member: TEMP-MicroStep PT100
member: TEMP-MicroStep PT100D
member: TEMP-MicroStep TPP
member: TEMP-MicroStep TPS Class 1/3 DIN
member: TEMP-MicroStep TPS Class 1/5 DIN
member: TEMP-MicroStep TPS Class 1/10 DIN
modified: 2025-04-11T13:12:45

TEMP-Nokeval IKES
type: Concept
in scheme: icos_instruments
broader: TEMP-ElectResis
created: 2025-04-11T13:13:42
alternative label: Temperature, Nokeval, IKES
definition: Temperature, Nokeval, IKES PT100 family (includes both 2 and 4 wires version, and the IKES-TF)
modified: 2025-04-11T13:14:22

Nokeval
type: Collection
created: 2025-04-11T13:16:03
member: TEMP-Nokeval IKES
modified: 2025-04-11T13:16:19

TEMP-Pentronic 7910005
type: Concept
in scheme: icos_instruments
broader: TEMP-ElectResis
created: 2025-04-11T13:17:18
alternative label: Temperature, Pentronic, 7910005
modified: 2025-04-11T13:17:32

TEMP-Rotronic MPX02H
type: Concept
in scheme: icos_instruments
broader: TEMP-ElectResis
created: 2025-04-11T13:19:41
definition: Temperature, Rotronic, optional PT100 in Hygroclip MPX02H that hosts also the HC2-S sensor (includes MP102H and MP402H)
modified: 2025-04-11T13:21:57

Rotronic optional PT100 in Hygromet MP102H
type: Concept
in scheme: icos_instruments
broader: TEMP-Rotronic MPX02H
created: 2025-04-11T13:20:28
modified: 2025-04-11T14:47:05

Rotronic optional PT100 in Hygromet MP402H
type: Concept
in scheme: icos_instruments
broader: TEMP-Rotronic MPX02H
created: 2025-04-11T13:20:46
modified: 2025-04-11T14:47:24

TEMP-Generic PT100(0) Class 1/10 DIN
type: Concept
in scheme: icos_instruments
broader: TEMP-ElectResis
created: 2025-04-11T14:35:48
alternative label: Temperature, Generic, PT100 Class 1/10 DIN family
definition: Temperature, Generic, PT100 Class 1/10 DIN family (includes all the models corresponding to Class 1/10 DIN accuracy)
modified: 2025-04-11T14:36:41

Setra Systems
type: Collection
created: 2025-04-14T16:25:37
member: Setra 270 (and CS equivalent)
modified: 2025-04-14T16:29:35

Rotronic Instruments
type: Collection
created: 2025-04-11T14:37:44
definition: Global company that is a brand of the Processing Sensing Technologies (PST) group.
member: TEMP-Rotronic MPX02H
modified: 2025-04-11T14:53:57
member: Rotronic optional PT100 in Hygromet MP102H
member: Rotronic optional PT100 in Hygromet MP402H

Pentronic
type: Collection
created: 2025-04-11T14:57:53

TEMP-Generic PT100(0) Class 1/3 DIN
type: Concept
in scheme: icos_instruments
broader: TEMP-ElectResis
created: 2025-04-11T15:00:17
definition: Temperature, Generic, PT100 Class 1/3 DIN family (includes all the models corresponding to Class 1/3 DIN accuracy)
alternative label: Temperature, Generic, PT100 Class 1/3 DIN family
modified: 2025-04-11T15:01:01

TEMP-Generic PT100(0) Class A
type: Concept
in scheme: icos_instruments
broader: TEMP-ElectResis
created: 2025-04-11T15:01:19
definition: Temperature, Generic, PT100 Class A family (includes all the models corresponding to Class A accuracy)
alternative label: Temperature, Generic, PT100 Class A family
modified: 2025-04-11T15:01:54

TEMP-Generic PT100(0) Class B
type: Concept
in scheme: icos_instruments
broader: TEMP-ElectResis
created: 2025-04-11T15:02:14
alternative label: Temperature, Generic, PT100 Class B
definition: Temperature, Generic, PT100 Class B family (includes all the models corresponding to Class B accuracy)
modified: 2025-04-11T15:02:53

TEMP-Young 41342
type: Concept
in scheme: icos_instruments
broader: TEMP-ElectResis
created: 2025-04-11T15:03:11
definition: Temperature, Young, 41342 series (also named CS41342 and 43347 when sold with the shield 43502 or 41003-5)
alternative label: Temperature, Young, 41342 series
modified: 2025-04-11T15:06:21

Setra 278 (and CS or Thies equivalent)
type: Concept
in scheme: icos_instruments
created: 2025-04-14T16:30:52
alternative label: Atmospheric Pressure, Setra, 278
definition: Atmospheric Pressure, Setra, 278 (also named CS100 or Thies B-278-2T)
broader: Electronic barometer
modified: 2026-02-06T13:19:55

R. M. Young Company
type: Collection
created: 2025-04-11T15:06:36
member: TEMP-Young 41342
alternative label: Young
member: Young 61302
modified: 2025-04-14T17:00:01

TEMP-IntegratedCircuit
type: Concept
in scheme: icos_instruments
broader: temperature sensor
created: 2025-04-11T15:28:52
definition: Temperature, Integrated Circuit sensor
alternative label: Temperature, Integrated Circuit sensor
modified: 2025-04-11T15:29:31

TEMP-Meter TEROS06
type: Concept
in scheme: icos_instruments
broader: TEMP-IntegratedCircuit
created: 2025-04-11T15:32:06
alternative label: Temperature, Meter, TEROS06
modified: 2025-04-11T15:32:27

TEMP-Meter TH3-x
type: Concept
in scheme: icos_instruments
broader: TEMP-IntegratedCircuit
created: 2025-04-11T15:32:52
definition: Temperature, Meter, TH3-x (includes TH3-v and TH3-s)
alternative label: Temperature, Meter, TH3-x
modified: 2025-04-11T15:33:27

Meter TH3-s
type: Concept
in scheme: icos_instruments
broader: TEMP-Meter TH3-x
created: 2025-04-11T15:34:09

Meter TH3-v
type: Concept
in scheme: icos_instruments
broader: TEMP-Meter TH3-x
created: 2025-04-11T15:34:24

TEMP-Texas LM35XX(X)
type: Concept
in scheme: icos_instruments
broader: TEMP-IntegratedCircuit
created: 2025-04-11T15:37:05
definition: Temperature, Texas Instruments, LM35 family (includes LM35AH, LM35AH/NOPB, LM35CAH, LM35CAH/NOPB, LM35CAZ/LFT4, LM35CAZ/NOPB, LM35CH, LM35CH/NOPB, LM35CZ/LFT1, LM35CZ/NOPB, LM35DH, LM35DH/NOPB, LM35DM/NOPB, LM35DMX/NOPB, LM35DT/NOPB, LM35DZ/LFT1, LM35DZ/LFT4, LM35DZ/NOPB, LM35H, LM35H/NOPB, LM35DM, LM35DMX, LM35DT)
alternative label: Temperature, Texas Instruments, LM35 family
modified: 2025-04-11T15:37:48

Texas Instruments
type: Collection
created: 2025-04-11T15:41:04
member: TEMP-Texas LM35XX(X)
modified: 2025-04-11T15:46:41

WeatherHawk WeatherHawk 610 Pressure component
type: Concept
in scheme: icos_instruments
created: 2025-04-14T16:55:14
definition: Atmospheric Pressure, WeatherHawk, 610 weather station (air pressure sensor)
broader: Electronic barometer
modified: 2026-02-06T14:25:01

Young 61302
type: Concept
in scheme: icos_instruments
created: 2025-04-14T16:56:52
broader: Electronic barometer
definition: Atmospheric Pressure, Young, 61302 series
modified: 2026-02-06T14:25:09

Gill Instruments
type: Collection
created: 2025-04-14T16:57:34
member: Gill MaxiMet GMXxxx series Pressure component
member: Gill MaxiMet GMX100 series Pressure component
member: Gill MaxiMet GMX200 series Pressure component
member: Gill MaxiMet GMX300 series Pressure component
member: Gill MaxiMet GMX301 series Pressure component
member: Gill MaxiMet GMX400 series Pressure component
member: Gill MaxiMet GMX500 series Pressure component
member: Gill MaxiMet GMX501 series Pressure component
member: Gill MaxiMet GMX531 series Pressure component
member: Gill MaxiMet GMX551 series Pressure component
member: Gill MaxiMet GMX600 series Pressure component
member: Gill MaxiMet GMXxxx series Rain component
member: Gill MaxiMet GMX100 series Rain component
member: Gill MaxiMet GMX200 series Rain component
member: Gill MaxiMet GMX300 series Rain component
member: Gill MaxiMet GMX301 series Rain component
modified: 2025-04-14T18:02:03
member: Gill MaxiMet GMX400 series Rain component
member: Gill MaxiMet GMX500 series Rain component
member: Gill MaxiMet GMX501 series Rain component
member: Gill MaxiMet GMX531 series Rain component
member: Gill MaxiMet GMX551 series Rain component
member: Gill MaxiMet GMX600 series Rain component

Gill MaxiMet GMXxxx series Pressure component
type: Concept
in scheme: icos_instruments
created: 2025-04-14T17:00:48
definition: Atmospheric pressure, Gill, MaxiMet GMXxxx weather station (Pressure sensor. Includes GMX100, GMX300, GMX301, GMX400, GMX200, GMX500, GMX501, GMX531, GMX551, GMX600)
broader: Other technology barometer
modified: 2026-02-06T14:46:23

Gill MaxiMet GMX100 series Pressure component
type: Concept
in scheme: icos_instruments
broader: Gill MaxiMet GMXxxx series Pressure component
created: 2025-04-14T17:17:12
broader: Gill MaxiMet GMXxxx series weather station
modified: 2025-04-14T17:38:16

Gill MaxiMet GMX300 series Pressure component
type: Concept
in scheme: icos_instruments
broader: Gill MaxiMet GMXxxx series Pressure component
created: 2025-04-14T17:17:34
broader: Gill MaxiMet GMXxxx series weather station
modified: 2025-04-14T17:40:15

Gill MaxiMet GMX301 series Pressure component
type: Concept
in scheme: icos_instruments
broader: Gill MaxiMet GMXxxx series Pressure component
created: 2025-04-14T17:17:44
broader: Gill MaxiMet GMXxxx series weather station
modified: 2025-04-14T17:40:28

Gill MaxiMet GMX400 series Pressure component
type: Concept
in scheme: icos_instruments
broader: Gill MaxiMet GMXxxx series Pressure component
created: 2025-04-14T17:17:55
broader: Gill MaxiMet GMXxxx series weather station
modified: 2025-04-14T17:40:50

Gill MaxiMet GMX200 series Pressure component
type: Concept
in scheme: icos_instruments
broader: Gill MaxiMet GMXxxx series Pressure component
created: 2025-04-14T17:18:04
broader: Gill MaxiMet GMXxxx series weather station
modified: 2025-04-14T17:40:02

Gill MaxiMet GMX500 series Pressure component
type: Concept
in scheme: icos_instruments
broader: Gill MaxiMet GMXxxx series Pressure component
created: 2025-04-14T17:18:17
broader: Gill MaxiMet GMXxxx series weather station
modified: 2025-04-14T17:41:04

Gill MaxiMet GMX501 series Pressure component
type: Concept
in scheme: icos_instruments
broader: Gill MaxiMet GMXxxx series Pressure component
created: 2025-04-14T17:18:28
broader: Gill MaxiMet GMXxxx series weather station
modified: 2025-04-14T17:41:20

Gill MaxiMet GMX531 series Pressure component
type: Concept
in scheme: icos_instruments
broader: Gill MaxiMet GMXxxx series Pressure component
created: 2025-04-14T17:18:40
broader: Gill MaxiMet GMXxxx series weather station
modified: 2025-04-14T17:41:34

Gill MaxiMet GMX551 series Pressure component
type: Concept
in scheme: icos_instruments
broader: Gill MaxiMet GMXxxx series Pressure component
created: 2025-04-14T17:18:50
broader: Gill MaxiMet GMXxxx series weather station
modified: 2025-04-14T17:41:51

Gill MaxiMet GMX600 series Pressure component
type: Concept
in scheme: icos_instruments
broader: Gill MaxiMet GMXxxx series Pressure component
created: 2025-04-14T17:19:06
broader: Gill MaxiMet GMXxxx series weather station
modified: 2025-04-14T17:42:03

Gill MaxiMet GMXxxx series weather station
type: Concept
in scheme: icos_instruments
broader: weather station
created: 2025-04-14T17:36:46

precipitation sensor
type: Concept
in scheme: icos_instruments
broader: instrument type
created: 2025-04-14T17:47:43
definition: precipitation sensor measuring rain and snow
modified: 2025-04-14T17:51:01

Gill MaxiMet GMXxxx series Rain component
type: Concept
in scheme: icos_instruments
created: 2025-04-14T17:53:39
definition: Rain (optical gauge), Gill, MaxiMet GMXxxx weather station (Precipitation sensor. Includes GMX100, GMX300, GMX301, GMX400, GMX200, GMX500, GMX501, GMX531, GMX551, GMX600)
broader: Optical precipitation gauge
modified: 2026-02-06T19:12:46

Gill MaxiMet GMX100 series Rain component
type: Concept
in scheme: icos_instruments
broader: Gill MaxiMet GMXxxx series Rain component
created: 2025-04-14T17:56:50
broader: Gill MaxiMet GMXxxx series weather station
modified: 2025-04-14T18:01:25

Gill MaxiMet GMX300 series Rain component
type: Concept
in scheme: icos_instruments
broader: Gill MaxiMet GMXxxx series Rain component
created: 2025-04-14T17:57:00
broader: Gill MaxiMet GMXxxx series weather station
modified: 2025-04-14T18:01:11

Gill MaxiMet GMX301 series Rain component
type: Concept
in scheme: icos_instruments
broader: Gill MaxiMet GMXxxx series Rain component
created: 2025-04-14T17:57:11
broader: Gill MaxiMet GMXxxx series weather station
modified: 2025-04-14T18:00:58

Gill MaxiMet GMX400 series Rain component
type: Concept
in scheme: icos_instruments
broader: Gill MaxiMet GMXxxx series Rain component
created: 2025-04-14T17:57:20
broader: Gill MaxiMet GMXxxx series weather station
modified: 2025-04-14T18:00:46

Gill MaxiMet GMX200 series Rain component
type: Concept
in scheme: icos_instruments
broader: Gill MaxiMet GMXxxx series Rain component
created: 2025-04-14T17:57:30
broader: Gill MaxiMet GMXxxx series weather station
modified: 2025-04-14T18:00:35

Gill MaxiMet GMX500 series Rain component
type: Concept
in scheme: icos_instruments
broader: Gill MaxiMet GMXxxx series Rain component
created: 2025-04-14T17:57:43
broader: Gill MaxiMet GMXxxx series weather station
modified: 2025-04-14T18:00:20

Gill MaxiMet GMX501 series Rain component
type: Concept
in scheme: icos_instruments
broader: Gill MaxiMet GMXxxx series Rain component
created: 2025-04-14T17:57:51
broader: Gill MaxiMet GMXxxx series weather station
modified: 2025-04-14T18:00:10

Gill MaxiMet GMX531 series Rain component
type: Concept
in scheme: icos_instruments
broader: Gill MaxiMet GMXxxx series Rain component
created: 2025-04-14T17:58:01
broader: Gill MaxiMet GMXxxx series weather station
modified: 2025-04-14T17:59:56

Gill MaxiMet GMX551 series Rain component
type: Concept
in scheme: icos_instruments
broader: Gill MaxiMet GMXxxx series Rain component
created: 2025-04-14T17:58:16
broader: Gill MaxiMet GMXxxx series weather station
modified: 2025-04-14T17:59:45

Gill MaxiMet GMX600 series Rain component
type: Concept
in scheme: icos_instruments
broader: Gill MaxiMet GMXxxx series Rain component
created: 2025-04-14T17:58:26
broader: Gill MaxiMet GMXxxx series weather station
modified: 2025-04-14T17:59:26

Thies Clima 5.4110 series
type: Concept
in scheme: icos_instruments
created: 2025-04-14T18:02:20
definition: Precipitation (optical gauge), Thies, Laser-Niederschlags-Monitor, 54110 series
broader: Optical precipitation gauge
modified: 2026-02-06T19:20:53

Thies Clima
type: Collection
created: 2025-04-14T18:03:24
member: Thies Clima 5.4110 series
member: PREC-Thies 54000
modified: 2025-04-17T18:02:46

Vaisala FD12P
type: Concept
in scheme: icos_instruments
created: 2025-04-14T18:09:24
definition: Precipitation (optical gauge), Vaisala, FD12P
broader: Optical precipitation gauge
modified: 2026-02-06T19:24:09

PREC-TipBucGauge
type: Concept
in scheme: icos_instruments
broader: precipitation sensor
created: 2025-04-14T18:12:39
definition: Tipping bucket precipitation gauge (measuring rain and snow)
modified: 2025-04-15T18:47:19

AMET Tipping Bucket
type: Concept
in scheme: icos_instruments
created: 2025-04-14T18:12:52
broader: Tipping bucket precipitation gauge
definition: Rain (tipping bucket gauge), AMET, generic model
modified: 2026-02-06T19:28:52

Amet
type: Collection
created: 2025-04-14T18:18:05
member: AMET Tipping Bucket
modified: 2025-04-14T18:18:25

Pronamic Rain-O-Matic 400.042 - XX
type: Concept
in scheme: icos_instruments
created: 2025-04-14T18:18:43
definition: Precipitation (tipping bucket gauge), Pronamic, Rain-O-Matic 400.042 - XX series (includes 400.042 - 10, 400.042 - 20, 400.042 - 25, 400.042 - 50. Also named Rain-O-Matic Meteorological Snow & Rain)
broader: Tipping bucket precipitation gauge
modified: 2026-02-06T19:32:51

Pronamic Rain-O-Matic 400.042-10
type: Concept
in scheme: icos_instruments
broader: Pronamic Rain-O-Matic 400.042 - XX
created: 2025-04-14T18:22:18

Pronamic Rain-O-Matic 400.042-25
type: Concept
in scheme: icos_instruments
broader: Pronamic Rain-O-Matic 400.042 - XX
created: 2025-04-14T18:22:27
modified: 2025-04-17T17:03:06

Pronamic Rain-O-Matic 400.042-50
type: Concept
in scheme: icos_instruments
broader: Pronamic Rain-O-Matic 400.042 - XX
created: 2025-04-14T18:22:35
modified: 2025-04-17T17:03:22

PREC-Senseca HD2013
type: Concept
in scheme: icos_instruments
broader: PREC-TipBucGauge
created: 2025-04-14T18:23:27
definition: Precipitation (tipping bucket gauge), Senseca, HD2013 (previous company name DeltaOhm)
alternative label: Precipitation (tipping bucket gauge), Senseca, HD2013
modified: 2025-04-14T18:23:58

PREC-Senseca HD2015
type: Concept
in scheme: icos_instruments
broader: PREC-TipBucGauge
created: 2025-04-14T18:24:15
definition: Precipitation (tipping bucket gauge), Senseca, HD2015 (previous company name DeltaOhm)
alternative label: Precipitation (tipping bucket gauge), Senseca, HD2015
modified: 2025-04-14T18:25:13

PREC-WeightGauge
type: Concept
in scheme: icos_instruments
broader: precipitation sensor
created: 2025-04-14T18:25:47
definition: Weighing precipitation gauge (measuring rain and snow)
modified: 2025-04-15T18:47:38

PREC-Geonor T200x
type: Concept
in scheme: icos_instruments
broader: PREC-WeightGauge
created: 2025-04-14T18:26:11
alternative label: Precipitation (weighing gauge), Geonor, T-200 series
definition: Precipitation (weighing gauge), Geonor, T-200 series (include series T-200B, T-200BM, T-200BMD, T-200BHC)
modified: 2025-04-15T17:27:39

Senseca Italy
type: Collection
created: 2025-04-14T18:26:24
member: PREC-Senseca HD2013
member: PREC-Senseca HD2015
member: PREC-Senseca HD2016
modified: 2025-04-15T18:41:53

Pronamic
type: Collection
created: 2025-04-14T18:28:23
member: Pronamic Rain-O-Matic 400.042 - XX
member: Pronamic Rain-O-Matic 400.042-10
member: Pronamic Rain-O-Matic 400.042-25
member: Pronamic Rain-O-Matic 400.042-50
member: PREC-Pronamic 200.002-XX
member: Pronamic Rain-O-Matic 200.002 - 10
member: Pronamic Rain-O-Matic 200.002 - 20
member: Pronamic Rain-O-Matic 200.002 - 25
member: Pronamic Rain-O-Matic 200.002 - 50
member: PREC-Pronamic 300.02X-XXGC
member: Pronamic 300.021 - 10GC
member: Pronamic 300.021 - 20GC
member: Pronamic 300.021 - 25GC
member: Pronamic 300.021 - 50GC
member: Pronamic 300.023 - 10GC
modified: 2025-04-17T17:45:10
member: Pronamic 300.023 - 20GC
member: Pronamic 300.023 - 25GC
member: Pronamic 300.023 - 50GC

Geonor
type: Collection
created: 2025-04-14T18:32:34
member: PREC-Geonor T200x
member: Geonor T-200B
modified: 2025-04-15T17:28:35
member: Geonor T-200BHC
member: Geonor T-200BM
member: Geonor T-200BMD

Geonor T-200B
type: Concept
in scheme: icos_instruments
broader: PREC-Geonor T200x
created: 2025-04-15T17:25:21

Geonor T-200BM
type: Concept
in scheme: icos_instruments
broader: PREC-Geonor T200x
created: 2025-04-15T17:25:34

Geonor T-200BMD
type: Concept
in scheme: icos_instruments
broader: PREC-Geonor T200x
created: 2025-04-15T17:25:59

Geonor T-200BHC
type: Concept
in scheme: icos_instruments
broader: PREC-Geonor T200x
created: 2025-04-15T17:26:13

PREC-Lambrecht rainE(Modbus)
type: Concept
in scheme: icos_instruments
broader: PREC-WeightGauge
created: 2025-04-15T17:28:56
alternative label: Precipitation (weighing gauge), Lambrecht, rain[e](Modbus)
definition: Precipitation (weighing gauge), Lambrecht, rain[e](Modbus)(includes the heated versions only of: rain[e] and rain[e] Modbus)
modified: 2025-04-15T17:29:52

Lambrecht rain[e]
type: Concept
in scheme: icos_instruments
broader: PREC-Lambrecht rainE(Modbus)
created: 2025-04-15T17:33:53

Lambrecht rain[e] Modbus
type: Concept
in scheme: icos_instruments
broader: PREC-Lambrecht rainE(Modbus)
created: 2025-04-15T17:34:06

PREC-Lambrecht rainE400
type: Concept
in scheme: icos_instruments
broader: PREC-WeightGauge
created: 2025-04-15T18:18:30
alternative label: Precipitation (weighing gauge), Lambrecht, rain[e]400
definition: Precipitation (weighing gauge), Lambrecht, rain[e]400 (includes its heated version only)
modified: 2025-04-15T18:19:14

PREC-Lambrecht rainEH3
type: Concept
in scheme: icos_instruments
broader: PREC-WeightGauge
created: 2025-04-15T18:19:27
alternative label: Precipitation (weighing gauge), Lambrecht, rain[e]H3
modified: 2025-04-15T18:19:45

PREC-Lambrecht rainEone(Modbus)
type: Concept
in scheme: icos_instruments
broader: PREC-WeightGauge
created: 2025-04-15T18:20:02
alternative label: Precipitation (weighing gauge), Lambrecht, rain[e]one(Modbus)
definition: Precipitation (weighing gauge), Lambrecht, rain[e]one(Modbus)(includes the heated version only of: rain[e]one and rain[e]one Modbus)
modified: 2025-04-15T18:21:18

Lambrecht rain[e]one
type: Concept
in scheme: icos_instruments
broader: PREC-Lambrecht rainEone(Modbus)
created: 2025-04-15T18:20:23

Lambrecht rain[e]one Modbus
type: Concept
in scheme: icos_instruments
broader: PREC-Lambrecht rainEone(Modbus)
created: 2025-04-15T18:20:38

PREC-Lambrecht rainEUnheated
type: Concept
in scheme: icos_instruments
broader: PREC-WeightGauge
created: 2025-04-15T18:21:31
alternative label: Precipitation (weighing gauge), Lambrecht, rain[e] series unheated
definition: Precipitation (weighing gauge), Lambrecht, rain[e] series unheated (includes rain[e]LP and the unheated versions only of: rain[e], rain[e]400, rain[e] Modbus, rain[e]one, rain[e]one Modbus)
modified: 2025-04-15T18:22:31

Lambrecht rain[e]LP - unheated
type: Concept
in scheme: icos_instruments
broader: PREC-Lambrecht rainEUnheated
created: 2025-04-15T18:23:15

Lambrecht rain[e] - unheated
type: Concept
in scheme: icos_instruments
broader: PREC-Lambrecht rainEUnheated
created: 2025-04-15T18:26:09

Lambrecht rain[e]400 - unheated
type: Concept
in scheme: icos_instruments
broader: PREC-Lambrecht rainEUnheated
created: 2025-04-15T18:26:28

Lambrecht rain[e] Modbus - unheated
type: Concept
in scheme: icos_instruments
broader: PREC-Lambrecht rainEUnheated
created: 2025-04-15T18:26:56

Lambrecht rain[e]one - unheated
type: Concept
in scheme: icos_instruments
broader: PREC-Lambrecht rainEUnheated
created: 2025-04-15T18:27:19

Lambrecht rain[e]one Modbus - unheated
type: Concept
in scheme: icos_instruments
broader: PREC-Lambrecht rainEUnheated
created: 2025-04-15T18:27:48

Lambrecht Meteo
type: Collection
created: 2025-04-15T18:28:16
member: PREC-Lambrecht rainE400
member: PREC-Lambrecht rainEH3
member: PREC-Lambrecht rainE(Modbus)
member: Lambrecht rain[e]
member: Lambrecht rain[e] Modbus
member: PREC-Lambrecht rainEone(Modbus)
member: Lambrecht rain[e]one
member: Lambrecht rain[e]one Modbus
member: PREC-Lambrecht rainEUnheated
member: Lambrecht rain[e] - unheated
member: Lambrecht rain[e] Modbus - unheated
member: Lambrecht rain[e]400 - unheated
member: Lambrecht rain[e]LP - unheated
member: Lambrecht rain[e]one - unheated
member: Lambrecht rain[e]one Modbus - unheated
member: PREC-Lambrecht 1518x
member: Lambrecht 1518H3
member: Lambrecht 15189
member: Lambrecht 15189H
modified: 2025-04-17T12:53:17

PREC-MPS TRwSx
type: Concept
in scheme: icos_instruments
broader: PREC-WeightGauge
created: 2025-04-15T18:31:19
definition: Precipitation (weighing gauge), MPS System, TRwS series (includes series TRwS204, TRwS504, TRwS205, TRwS405, TRwS214, TRwS514, TRwS215, TRwS415)
alternative label: Precipitation (weighing gauge), MPS System, TRwS series
modified: 2025-04-15T18:31:56

MPS System TRwS204
type: Concept
in scheme: icos_instruments
broader: PREC-MPS TRwSx
created: 2025-04-15T18:32:31

MPS System TRwS504
type: Concept
in scheme: icos_instruments
broader: PREC-MPS TRwSx
created: 2025-04-15T18:32:47

MPS System TRwS205
type: Concept
in scheme: icos_instruments
broader: PREC-MPS TRwSx
created: 2025-04-15T18:33:04

MPS System TRwS405
type: Concept
in scheme: icos_instruments
broader: PREC-MPS TRwSx
created: 2025-04-15T18:33:23

MPS System TRwS214
type: Concept
in scheme: icos_instruments
broader: PREC-MPS TRwSx
created: 2025-04-15T18:33:40

MPS System TRwS514
type: Concept
in scheme: icos_instruments
broader: PREC-MPS TRwSx
created: 2025-04-15T18:33:55

MPS System TRwS215
type: Concept
in scheme: icos_instruments
broader: PREC-MPS TRwSx
created: 2025-04-15T18:34:08

MPS System TRwS415
type: Concept
in scheme: icos_instruments
broader: PREC-MPS TRwSx
created: 2025-04-15T18:34:19

MPS System
type: Collection
created: 2025-04-15T18:34:58
member: PREC-MPS TRwSx
member: MPS System TRwS204
member: MPS System TRwS205
member: MPS System TRwS214
member: MPS System TRwS215
modified: 2025-04-15T18:37:10
member: MPS System TRwS405
member: MPS System TRwS415
member: MPS System TRwS504
member: MPS System TRwS514

PREC-OTT Pluvio2
type: Concept
in scheme: icos_instruments
broader: PREC-WeightGauge
created: 2025-04-15T18:37:29
alternative label: Precipitation (weighing gauge), OTT, Pluvio2
definition: Precipitation (weighing gauge), OTT, Pluvio2
modified: 2025-04-15T18:38:03

OTT
type: Collection
created: 2025-04-15T18:38:41
member: PREC-OTT Pluvio2
modified: 2025-04-15T18:53:23

PREC-Senseca HD2016
type: Concept
in scheme: icos_instruments
broader: PREC-WeightGauge
created: 2025-04-15T18:40:44
alternative label: Precipitation (weighing gauge), Senseca, HD2016
definition: Precipitation (weighing gauge), Senseca, HD2016 (previous company name DeltaOhm)
modified: 2025-04-15T18:41:26

RAIN-Other
type: Concept
in scheme: icos_instruments
broader: precipitation sensor
created: 2025-04-15T18:48:03

PREC-Meter Atmos41
type: Concept
in scheme: icos_instruments
broader: RAIN-Other
created: 2025-04-15T18:54:06
alternative label: Rain (rain sensor), Meter, Atmos41 weather station
definition: Rain (rain sensor), Meter, Atmos41 weather station
broader: Meter Atmos41 weather station
modified: 2025-04-15T18:56:14

Meter Atmos41 weather station
type: Concept
in scheme: icos_instruments
broader: weather station
created: 2025-04-15T18:55:31

PREC-Vaisala WXT5XX
type: Concept
in scheme: icos_instruments
broader: RAIN-Other
created: 2025-04-15T18:57:43
alternative label: Rain (rain sensor), Vaisala, WXT520 and WXT530 series Weather Transmitter
definition: Rain (rain sensor), Vaisala, WXT520 and WXT530 series Weather Transmitter (includes WXT520, WXT531, WXT533, WXT535 and WXT536)
modified: 2025-04-15T18:58:22

Vaisala PTU-Module on WXT520 and WXT530 series Weather Transmitter (excluding PTU30T)
type: Concept
in scheme: icos_instruments
broader: weather station
created: 2025-04-15T19:00:50
definition: Atmospheric Pressure, Air Relative Humidity and Temperature, Vaisala, PTU(x) (PTU-Module on WXT520 and WXT530 series Weather Transmitter)
modified: 2026-02-06T16:26:41

Vaisala Weather Transmitter WXT520
type: Concept
in scheme: icos_instruments
broader: Vaisala PTU-Module on WXT520 and WXT530 series Weather Transmitter (excluding PTU30T)
created: 2025-04-15T19:02:48

Vaisala Weather Transmitter WXT520 Rain sensor
type: Concept
in scheme: icos_instruments
broader: PREC-Vaisala WXT5XX
created: 2025-04-15T19:03:56
broader: Vaisala Weather Transmitter WXT520
modified: 2025-04-15T19:04:16

Vaisala Weather Transmitter WXT530 Rain sensor
type: Concept
in scheme: icos_instruments
broader: PREC-Vaisala WXT5XX
created: 2025-04-15T19:04:39
broader: Vaisala Weather Transmitter WXT530
modified: 2025-04-15T19:05:46

Vaisala Weather Transmitter WXT530
type: Concept
in scheme: icos_instruments
broader: Vaisala PTU-Module on WXT520 and WXT530 series Weather Transmitter (excluding PTU30T)
created: 2025-04-15T19:05:07

WeatherHawk 610 weather station
type: Concept
in scheme: icos_instruments
broader: weather station
created: 2025-04-15T19:07:24

PREC-WeatherHawk 610
type: Concept
in scheme: icos_instruments
broader: RAIN-Other
created: 2025-04-15T19:09:26
alternative label: Rain (rain sensor), WeatherHawk, 610 weather station
definition: Rain (rain sensor), WeatherHawk, 610 weather station
broader: WeatherHawk 610 weather station
modified: 2025-04-15T19:10:20

RAIN-TipBucGauge
type: Concept
in scheme: icos_instruments
broader: precipitation sensor
created: 2025-04-16T19:51:47
definition: Tipping bucket rain gauge (measuring only rain)
modified: 2025-04-17T18:08:26

PREC-Casella 10K
type: Concept
in scheme: icos_instruments
broader: RAIN-TipBucGauge
created: 2025-04-16T19:52:11
alternative label: Rain (tipping bucket gauge), Casella, 100000E
definition: Rain (tipping bucket gauge), Casella, 100000E (inlcuded versions 102471E, 100000E, 100573E)
modified: 2025-04-16T19:52:53

Casella 100000E
type: Concept
in scheme: icos_instruments
broader: PREC-Casella 10K
created: 2025-04-16T19:53:17

Casella 102471E
type: Concept
in scheme: icos_instruments
broader: PREC-Casella 10K
created: 2025-04-16T19:53:37

Casella 100573E
type: Concept
in scheme: icos_instruments
broader: PREC-Casella 10K
created: 2025-04-16T19:54:02

Casella Solutions
type: Collection
created: 2025-04-16T19:54:35
member: PREC-Casella 10K
member: Casella 100000E
member: Casella 100573E
modified: 2025-04-16T20:07:03
member: Casella 102471E

PREC-Davis 646[3/5](M)
type: Concept
in scheme: icos_instruments
broader: RAIN-TipBucGauge
created: 2025-04-16T19:59:32
alternative label: Rain (tipping bucket gauge), Davis, Stand Alone Rain Collector 6463 and 6465 series
definition: Rain (tipping bucket gauge), Davis, Stand Alone Rain Collector 6463 and 6465 series (includes 6463, 6463M, 6465 and 6465M)
modified: 2025-04-16T20:02:39

Davis Stand Alone Rain Collector 6463
type: Concept
in scheme: icos_instruments
broader: PREC-Davis 646[3/5](M)
created: 2025-04-16T20:03:46

Davis Stand Alone Rain Collector 6465
type: Concept
in scheme: icos_instruments
broader: PREC-Davis 646[3/5](M)
created: 2025-04-16T20:04:05

Davis Stand Alone Rain Collector 6463M
type: Concept
in scheme: icos_instruments
broader: PREC-Davis 646[3/5](M)
created: 2025-04-16T20:04:21

Davis Stand Alone Rain Collector 6465M
type: Concept
in scheme: icos_instruments
broader: PREC-Davis 646[3/5](M)
created: 2025-04-16T20:04:36
modified: 2025-04-16T20:05:10

Davis Instruments
type: Collection
created: 2025-04-16T20:05:24
member: PREC-Davis 646[3/5](M)
member: Davis Stand Alone Rain Collector 6463
member: Davis Stand Alone Rain Collector 6463M
member: Davis Stand Alone Rain Collector 6465
member: Davis Stand Alone Rain Collector 6465M
member: PREC-Davis 646[4/6](M)
member: Davis AeroCone Rain Collector 6464
member: Davis AeroCone Rain Collector 6464M
member: Davis AeroCone Rain Collector 6466
member: Davis AeroCone Rain Collector 6466M
member: PREC-Davis 785X(M)
member: Davis Stand Alone Rain Collector 7852
modified: 2025-04-16T20:17:12
member: Davis Stand Alone Rain Collector 7852M
member: Davis Stand Alone Rain Collector 7857
member: Davis Stand Alone Rain Collector 7857M

PREC-Davis 646[4/6](M)
type: Concept
in scheme: icos_instruments
broader: RAIN-TipBucGauge
created: 2025-04-16T20:11:51
alternative label: Rain (tipping bucket gauge), Davis, AeroCone Rain Collector 6464 and 6466 series
definition: Rain (tipping bucket gauge), Davis, AeroCone Rain Collector 6464 and 6466 series (includes 6464, 6464M, 6466 and 6466M)
modified: 2025-04-16T20:12:36

Davis AeroCone Rain Collector 6464
type: Concept
in scheme: icos_instruments
broader: PREC-Davis 646[4/6](M)
created: 2025-04-16T20:13:05

Davis AeroCone Rain Collector 6466
type: Concept
in scheme: icos_instruments
broader: PREC-Davis 646[4/6](M)
created: 2025-04-16T20:13:23

Davis AeroCone Rain Collector 6464M
type: Concept
in scheme: icos_instruments
broader: PREC-Davis 646[4/6](M)
created: 2025-04-16T20:13:46

Davis AeroCone Rain Collector 6466M
type: Concept
in scheme: icos_instruments
broader: PREC-Davis 646[4/6](M)
created: 2025-04-16T20:14:08

PREC-Davis 785X(M)
type: Concept
in scheme: icos_instruments
broader: RAIN-TipBucGauge
created: 2025-04-16T20:14:28
alternative label: Rain (tipping bucket gauge), Davis, Stand Alone Rain Collector 785X family
definition: Rain (tipping bucket gauge), Davis, Stand Alone Rain Collector 785X family (includes 7852, 7852M, 7857 and 7857M)
modified: 2025-04-16T20:15:02

Davis Stand Alone Rain Collector 7852
type: Concept
in scheme: icos_instruments
broader: PREC-Davis 785X(M)
created: 2025-04-16T20:15:28

Davis Stand Alone Rain Collector 7852M
type: Concept
in scheme: icos_instruments
broader: PREC-Davis 785X(M)
created: 2025-04-16T20:15:44

Davis Stand Alone Rain Collector 7857
type: Concept
in scheme: icos_instruments
broader: PREC-Davis 785X(M)
created: 2025-04-16T20:16:04

Davis Stand Alone Rain Collector 7857M
type: Concept
in scheme: icos_instruments
broader: PREC-Davis 785X(M)
created: 2025-04-16T20:16:20

PREC-DeltaT RG1
type: Concept
in scheme: icos_instruments
broader: RAIN-TipBucGauge
created: 2025-04-16T20:17:36
alternative label: Rain (tipping bucket gauge), Delta-T Devices, RG1
modified: 2025-04-16T20:17:52

PREC-Ecotech VA
type: Concept
in scheme: icos_instruments
broader: RAIN-TipBucGauge
created: 2025-04-17T12:33:35
alternative label: Rain (tipping bucket gauge), Ecotech, VA
modified: 2025-04-17T12:33:54

Ecotech
type: Collection
created: 2025-04-17T12:34:13
member: PREC-Ecotech VA
modified: 2025-04-17T12:37:37

PREC-EML ARG100
type: Concept
in scheme: icos_instruments
broader: RAIN-TipBucGauge
created: 2025-04-17T12:37:59
alternative label: Rain (tipping bucket gauge), EML Research, ARG100
modified: 2025-04-17T12:38:15

PREC-EML ARG314
type: Concept
in scheme: icos_instruments
broader: RAIN-TipBucGauge
created: 2025-04-17T12:38:32
alternative label: Rain (tipping bucket gauge), EML Research, ARG314
modified: 2025-04-17T12:38:49

PREC-EML Kalyx-RG
type: Concept
in scheme: icos_instruments
broader: RAIN-TipBucGauge
created: 2025-04-17T12:39:02
alternative label: Rain (tipping bucket gauge), EML Research, Kalyx-RG
definition: Rain (tipping bucket gauge), EML Research, Kalyx-RG (also commercialized by Campbell with the same code)
modified: 2025-04-17T17:52:45

EML
type: Collection
created: 2025-04-17T12:39:59
member: PREC-EML ARG100
member: PREC-EML ARG314
member: PREC-EML Kalyx-RG
member: PREC-EML SBS500(H)
member: EML SBS500
member: EML SBS500H - heated version
modified: 2025-04-17T12:47:02

PREC-EML SBS500(H)
type: Concept
in scheme: icos_instruments
broader: RAIN-TipBucGauge
created: 2025-04-17T12:42:51
alternative label: Rain (tipping bucket gauge), EML Research, SBS500 series
definition: Rain (tipping bucket gauge), EML Research, SBS500 series (includes the SBS500 and its heated version SBS500H. They are also commercialized by Campbell with the same codes)
modified: 2025-04-17T12:43:30

EML SBS500
type: Concept
in scheme: icos_instruments
broader: PREC-EML SBS500(H)
created: 2025-04-17T12:44:10

EML SBS500H - heated version
type: Concept
in scheme: icos_instruments
broader: PREC-EML SBS500(H)
created: 2025-04-17T12:44:43

PREC-Lambrecht 1518x
type: Concept
in scheme: icos_instruments
broader: RAIN-TipBucGauge
created: 2025-04-17T12:47:15
alternative label: Rain (tipping bucket gauge), Lambrecht, 1518 series.
definition: Rain (tipping bucket gauge), Lambrecht, 1518 series. Included versions 1518 H3, 15189, 15189 H
modified: 2025-04-17T12:47:50

Lambrecht 1518H3
type: Concept
in scheme: icos_instruments
broader: PREC-Lambrecht 1518x
created: 2025-04-17T12:48:24

Lambrecht 15189
type: Concept
in scheme: icos_instruments
broader: PREC-Lambrecht 1518x
created: 2025-04-17T12:48:36

Lambrecht 15189H
type: Concept
in scheme: icos_instruments
broader: PREC-Lambrecht 1518x
created: 2025-04-17T12:48:48

PREC-LSI DQA23X
type: Concept
in scheme: icos_instruments
created: 2025-04-17T12:53:29
broader: RAIN-TipBucGauge
alternative label: Rain (tipping bucket gauge), LSI LASTEM, DQA23X series
definition: Rain (tipping bucket gauge), LSI LASTEM, DQA23X series (without siphon: includes DQA230, 231, 235 and 236)
modified: 2025-04-17T12:54:30

LSI DQA230
type: Concept
in scheme: icos_instruments
broader: PREC-LSI DQA23X
created: 2025-04-17T12:54:58

LSI DQA231
type: Concept
in scheme: icos_instruments
created: 2025-04-17T12:55:06
broader: PREC-LSI DQA23X
modified: 2025-04-17T12:55:32

LSI DQA235
type: Concept
in scheme: icos_instruments
broader: PREC-LSI DQA23X
created: 2025-04-17T12:55:39

LSI DQA236
type: Concept
in scheme: icos_instruments
broader: PREC-LSI DQA23X
created: 2025-04-17T12:55:47

LSI LASTEM
type: Collection
created: 2025-04-17T12:57:05
member: PREC-LSI DQA23X
member: LSI DQA230
member: LSI DQA231
member: LSI DQA235
member: LSI DQA236
member: PREC-LSI DQA23X.X
modified: 2025-04-17T13:02:07
member: LSI LASTEM DQA230.1
member: LSI LASTEM DQA230.3
member: LSI LASTEM DQA231.1

PREC-LSI DQA23X.X
type: Concept
in scheme: icos_instruments
broader: RAIN-TipBucGauge
created: 2025-04-17T12:59:17
alternative label: Rain (tipping bucket gauge), LSI LASTEM, DQA23X.X series
definition: Rain (tipping bucket gauge), LSI LASTEM, DQA23X.X series (with siphon: includes DQA230.1, 230.3 and 231.1)
modified: 2025-04-17T13:00:00

LSI LASTEM DQA230.1
type: Concept
in scheme: icos_instruments
broader: PREC-LSI DQA23X.X
created: 2025-04-17T13:01:02

LSI LASTEM DQA230.3
type: Concept
in scheme: icos_instruments
broader: PREC-LSI DQA23X.X
created: 2025-04-17T13:01:15
modified: 2025-04-17T13:01:38

LSI LASTEM DQA231.1
type: Concept
in scheme: icos_instruments
broader: PREC-LSI DQA23X.X
created: 2025-04-17T13:01:28

PREC-MetOne 3xx
type: Concept
in scheme: icos_instruments
broader: RAIN-TipBucGauge
created: 2025-04-17T13:02:30
alternative label: Rain (tipping bucket gauge), Met One Instruments, 3xx series
definition: Rain (tipping bucket gauge), Met One Instruments, 3xx series (includes series from 370 to 380)
modified: 2025-04-17T13:03:03

Met One Instruments
type: Collection
created: 2025-04-17T13:08:31

Met One Instruments 370
type: Concept
in scheme: icos_instruments
broader: PREC-MetOne 3xx
created: 2025-04-17T13:08:55

Met One Instruments 372
type: Concept
in scheme: icos_instruments
broader: PREC-MetOne 3xx
created: 2025-04-17T13:10:18

Met One Instruments 380
type: Concept
in scheme: icos_instruments
broader: PREC-MetOne 3xx
created: 2025-04-17T13:10:45

Met One Instruments 375
type: Concept
in scheme: icos_instruments
broader: PREC-MetOne 3xx
created: 2025-04-17T13:12:33

Met One Instruments 376
type: Concept
in scheme: icos_instruments
broader: PREC-MetOne 3xx
created: 2025-04-17T13:12:43

Met One Instruments 377
type: Concept
in scheme: icos_instruments
broader: PREC-MetOne 3xx
created: 2025-04-17T13:12:52

Met One Instruments 379
type: Concept
in scheme: icos_instruments
broader: PREC-MetOne 3xx
created: 2025-04-17T13:13:00

PREC-Observator OMC-21x-2
type: Concept
in scheme: icos_instruments
broader: RAIN-TipBucGauge
created: 2025-04-17T13:13:31
definition: Rain (tipping bucket gauge), Observator, OMC-210-2 and OMC-212-2 families (include OMC-210-2-01, OMC-210-2-02, OMC-210-2-05, OMC-212-2-01, OMC-212-2-02 and OMC-212-2-05)
alternative label: Rain (tipping bucket gauge), Observator, OMC-210-2 and OMC-212-2 families
modified: 2025-04-17T15:45:20

Observator OMC-210-2-01
type: Concept
in scheme: icos_instruments
broader: PREC-Observator OMC-21x-2
created: 2025-04-17T15:45:55

Observator OMC-210-2-02
type: Concept
in scheme: icos_instruments
broader: PREC-Observator OMC-21x-2
created: 2025-04-17T15:46:32

Observator OMC-210-2-05
type: Concept
in scheme: icos_instruments
broader: PREC-Observator OMC-21x-2
created: 2025-04-17T15:46:45

Observator OMC-212-2-01
type: Concept
in scheme: icos_instruments
broader: PREC-Observator OMC-21x-2
created: 2025-04-17T15:47:03

Observator OMC-212-2-05
type: Concept
in scheme: icos_instruments
broader: PREC-Observator OMC-21x-2
created: 2025-04-17T15:47:32

Observator instruments
type: Collection
created: 2025-04-17T15:48:01
member: PREC-Observator OMC-21x-2
modified: 2025-04-17T16:57:45
member: Observator OMC-210-2-01
member: Observator OMC-210-2-02
member: Observator OMC-210-2-05
member: Observator OMC-212-2-01
member: Observator OMC-212-2-05

PREC-Onset (S-)RGX(-XXXX)
type: Concept
in scheme: icos_instruments
broader: RAIN-TipBucGauge
created: 2025-04-17T16:59:24
alternative label: Rain (tipping bucket gauge), Onset, includes RG3, RG3-M, S-RGA-M002, S-RGB-M002
definition: Rain (tipping bucket gauge), Onset, includes RG3, RG3-M, S-RGA-M002, S-RGB-M002
modified: 2025-04-17T17:00:04

Onset RG3
type: Concept
in scheme: icos_instruments
broader: PREC-Onset (S-)RGX(-XXXX)
created: 2025-04-17T17:00:20
modified: 2025-04-17T17:00:31

Onset RG3-M
type: Concept
in scheme: icos_instruments
broader: PREC-Onset (S-)RGX(-XXXX)
created: 2025-04-17T17:00:48

Onset S-RGA-M002
type: Concept
in scheme: icos_instruments
broader: PREC-Onset (S-)RGX(-XXXX)
created: 2025-04-17T17:04:04

Onset S-RGB-M002
type: Concept
in scheme: icos_instruments
broader: PREC-Onset (S-)RGX(-XXXX)
created: 2025-04-17T17:04:24

Onset Computer Corporation
type: Collection
created: 2025-04-17T17:26:44
member: PREC-Onset (S-)RGX(-XXXX)
modified: 2025-04-17T17:28:37
member: Onset RG3
member: Onset RG3-M
member: Onset S-RGA-M002
member: Onset S-RGB-M002

PREC-PrecMec R013029
type: Concept
in scheme: icos_instruments
broader: RAIN-TipBucGauge
created: 2025-04-17T17:28:58
alternative label: Rain (tipping bucket gauge), Precis Mecaniques, R013029
modified: 2025-04-17T17:29:28

Precis Mécanique
type: Collection
created: 2025-04-17T17:33:26
member: PREC-PrecMec R013029
modified: 2025-04-17T17:36:01

PREC-Pronamic 200.002-XX
type: Concept
in scheme: icos_instruments
broader: RAIN-TipBucGauge
created: 2025-04-17T17:36:35
alternative label: Rain (tipping bucket gauge), Pronamic, Rain-O-Matic 200.002 - XX series
definition: Rain (tipping bucket gauge), Pronamic, Rain-O-Matic 200.002 - XX series (includes 200.002 - 10, 200.002 - 20, 200.002 - 25, 200.002 - 50. Also named Rain-O-Matic Meteorological RainGauge)
modified: 2025-04-17T17:37:14

Pronamic Rain-O-Matic 200.002 - 10
type: Concept
in scheme: icos_instruments
broader: PREC-Pronamic 200.002-XX
created: 2025-04-17T17:38:05

Pronamic Rain-O-Matic 200.002 - 20
type: Concept
in scheme: icos_instruments
broader: PREC-Pronamic 200.002-XX
created: 2025-04-17T17:38:22

Pronamic Rain-O-Matic 200.002 - 25
type: Concept
in scheme: icos_instruments
broader: PREC-Pronamic 200.002-XX
created: 2025-04-17T17:38:41

Pronamic Rain-O-Matic 200.002 - 50
type: Concept
in scheme: icos_instruments
broader: PREC-Pronamic 200.002-XX
created: 2025-04-17T17:38:57

PREC-Pronamic 300.02X-XXGC
type: Concept
in scheme: icos_instruments
broader: RAIN-TipBucGauge
created: 2025-04-17T17:39:45
alternative label: Rain (tipping bucket gauge), Pronamic, 300.02X - XXGC series
definition: Rain (tipping bucket gauge), Pronamic, 300.02X - XXGC series (includes 300.021 - 10GC, 300.021 - 20GC, 300.021 - 25GC, 300.021 - 50GC and 300.023 - 10GC, 300.023 - 20GC, 300.023 - 25GC, 300.023 - 50GC. Also named Professional RainGauge)
modified: 2025-04-17T17:40:29

Pronamic 300.023 - 50GC
type: Concept
in scheme: icos_instruments
broader: PREC-Pronamic 300.02X-XXGC
created: 2025-04-17T17:40:54

Pronamic 300.023 - 25GC
type: Concept
in scheme: icos_instruments
broader: PREC-Pronamic 300.02X-XXGC
created: 2025-04-17T17:41:19

Pronamic 300.023 - 20GC
type: Concept
in scheme: icos_instruments
broader: PREC-Pronamic 300.02X-XXGC
created: 2025-04-17T17:41:50

Pronamic 300.023 - 10GC
type: Concept
in scheme: icos_instruments
broader: PREC-Pronamic 300.02X-XXGC
created: 2025-04-17T17:42:14

Pronamic 300.021 - 50GC
type: Concept
in scheme: icos_instruments
broader: PREC-Pronamic 300.02X-XXGC
created: 2025-04-17T17:42:51

Pronamic 300.021 - 20GC
type: Concept
in scheme: icos_instruments
broader: PREC-Pronamic 300.02X-XXGC
created: 2025-04-17T17:43:54

Pronamic 300.021 - 10GC
type: Concept
in scheme: icos_instruments
broader: PREC-Pronamic 300.02X-XXGC
created: 2025-04-17T17:44:04

Pronamic 300.021 - 25GC
type: Concept
in scheme: icos_instruments
broader: PREC-Pronamic 300.02X-XXGC
created: 2025-04-17T17:44:29

PREC-Seba RG X0(X)
type: Concept
in scheme: icos_instruments
broader: RAIN-TipBucGauge
created: 2025-04-17T17:45:22
alternative label: Rain (tipping bucket gauge), Seba, RG family
definition: Rain (tipping bucket gauge), Seba, RG family (includes RG 50 and RG 100)
modified: 2025-04-17T17:45:57

Seba RG 50
type: Concept
in scheme: icos_instruments
broader: PREC-Seba RG X0(X)
created: 2025-04-17T17:46:21

Seba RG100
type: Concept
in scheme: icos_instruments
broader: PREC-Seba RG X0(X)
created: 2025-04-17T17:46:30

SEBA Hydrometrie
type: Collection
created: 2025-04-17T17:46:42
member: PREC-Seba RG X0(X)
modified: 2025-04-17T17:50:37
member: Seba RG 50
member: Seba RG100

PREC-TexasEl TR-4
type: Concept
in scheme: icos_instruments
broader: RAIN-TipBucGauge
created: 2025-04-17T17:51:05
alternative label: Rain (tipping bucket gauge), Texas Electronics, TR-4
modified: 2025-04-17T17:54:22

Texas Electronics
type: Collection
created: 2025-04-17T17:56:55
member: PREC-TexasEl TR-4
member: PREC-TexasEl TR-525-W2
member: PREC-TexasEl TR-525I
member: PREC-TexasEl TR-525M
member: PREC-TexasEl TR-525USW
modified: 2025-04-17T18:02:12

PREC-TexasEl TR-525-W2
type: Concept
in scheme: icos_instruments
broader: RAIN-TipBucGauge
created: 2025-04-17T17:57:45
alternative label: Rain (tipping bucket gauge), Texas Electronics, TR-525-W2
modified: 2025-04-17T17:58:01

PREC-TexasEl TR-525I
type: Concept
in scheme: icos_instruments
broader: RAIN-TipBucGauge
created: 2025-04-17T17:58:12
alternative label: Rain (tipping bucket gauge), Texas Electronics, TR-525I (also named TE525 by Campbell Scientific)
modified: 2025-04-17T17:58:38

PREC-TexasEl TR-525M
type: Concept
in scheme: icos_instruments
broader: RAIN-TipBucGauge
created: 2025-04-17T17:59:46
alternative label: Rain (tipping bucket gauge), Texas Electronics, TR-525M (also named TE525MM by Campbell Scientific)
modified: 2025-04-17T18:00:03

PREC-TexasEl TR-525USW
type: Concept
in scheme: icos_instruments
broader: RAIN-TipBucGauge
created: 2025-04-17T18:00:55
alternative label: Rain (tipping bucket gauge), Texas Electronics, TR-525USW (also named TE525WS by Campbell Scientific)
modified: 2025-04-17T18:01:11

PREC-Thies 54000
type: Concept
in scheme: icos_instruments
broader: RAIN-TipBucGauge
created: 2025-04-17T18:01:22
alternative label: Rain (tipping bucket gauge), Thies, 54000 series
modified: 2025-04-17T18:01:38

PREC-Young 5220x
type: Concept
in scheme: icos_instruments
broader: RAIN-TipBucGauge
created: 2025-04-17T18:03:00
alternative label: Rain (tipping bucket gauge), Young, 5220x series
definition: Rain (tipping bucket gauge), Young, 5220x series (includes versions 52202 heated and 52203 not heated)
modified: 2025-04-17T18:03:32

Young 52202 heated
type: Concept
in scheme: icos_instruments
broader: PREC-Young 5220x
created: 2025-04-17T18:04:13

Young 52203 not heated
type: Concept
in scheme: icos_instruments
broader: PREC-Young 5220x
created: 2025-04-17T18:04:29

SNOW-Acoustic
type: Concept
in scheme: icos_instruments
broader: precipitation sensor
created: 2025-04-17T18:09:37
definition: Snow depth, Acoustic distance sensor
modified: 2025-04-17T18:09:57

SNOW-Optical
type: Concept
in scheme: icos_instruments
broader: precipitation sensor
created: 2025-04-17T18:10:10
definition: Snow depth, Opto-electronic distance sensor
modified: 2025-04-17T18:10:30

SNOW-AutoGradScale
type: Concept
in scheme: icos_instruments
broader: precipitation sensor
created: 2025-04-17T18:10:43
definition: Snow depth, Graduated scale (automatically read, including camera)
modified: 2025-04-17T18:11:02

SNOW-ManualGradScale
type: Concept
in scheme: icos_instruments
broader: precipitation sensor
created: 2025-04-17T18:11:15
definition: Snow depth, Graduated scale (manually read)
modified: 2025-04-17T18:11:39

SNOW-SnowTube
type: Concept
in scheme: icos_instruments
broader: precipitation sensor
created: 2025-04-17T18:11:52
definition: Snow tube (snowfall)
modified: 2025-04-17T18:12:26

SNOW-SnowPillow
type: Concept
in scheme: icos_instruments
broader: precipitation sensor
created: 2025-04-17T18:12:37
definition: Snow pillow (snowfall)
modified: 2025-04-17T18:12:56

SNOW-Radio_isotop
type: Concept
in scheme: icos_instruments
broader: precipitation sensor
created: 2025-04-17T18:13:10
definition: Radioisotope snowgauges (snowfall)
modified: 2025-04-17T18:13:28

SNOW-Other
type: Concept
in scheme: icos_instruments
broader: precipitation sensor
created: 2025-04-17T18:13:40

SNOW-JC Depth Sensor
type: Concept
in scheme: icos_instruments
broader: SNOW-Acoustic
created: 2025-04-17T18:16:06
alternative label: Snow depth (acoustic), Jodd Communications, Ultrasonic Depth Sensor
modified: 2025-04-17T18:16:22

Jodd Communications
type: Collection
created: 2025-04-17T18:16:46
member: SNOW-JC Depth Sensor
modified: 2025-04-17T18:17:05

SNOW-Jenoptik SHM30
type: Concept
in scheme: icos_instruments
created: 2025-04-17T18:18:23
broader: SNOW-Optical
alternative label: Snow depth, Jenoptik, SHM30
modified: 2025-04-17T18:21:50

Jenoptik
type: Collection
created: 2025-04-17T18:19:43
member: SNOW-Jenoptik SHM30
modified: 2025-04-17T18:45:01

SNOW-Microsonic mic+600
type: Concept
in scheme: icos_instruments
broader: SNOW-Acoustic
created: 2025-04-17T18:22:23
alternative label: Snow depth (acoustic), Microsonic, mic+600 family
modified: 2025-04-17T18:22:40

Microsonic mic+600/F/TC
type: Concept
in scheme: icos_instruments
broader: SNOW-Microsonic mic+600
created: 2025-04-17T18:23:17

Microsonic mic+600/D/TC
type: Concept
in scheme: icos_instruments
broader: SNOW-Microsonic mic+600
created: 2025-04-17T18:23:40

Microsonic mic+600/D/TC/E
type: Concept
in scheme: icos_instruments
broader: SNOW-Microsonic mic+600
created: 2025-04-17T18:23:58

Microsonic mic+600/E/TC
type: Concept
in scheme: icos_instruments
broader: SNOW-Microsonic mic+600
created: 2025-04-17T18:24:16

Microsonic mic+600/DD/TC
type: Concept
in scheme: icos_instruments
broader: SNOW-Microsonic mic+600
created: 2025-04-17T18:24:38

Microsonic mic+600/DD/TC/E
type: Concept
in scheme: icos_instruments
broader: SNOW-Microsonic mic+600
created: 2025-04-17T18:25:06

Microsonic mic+600/EE/TC
type: Concept
in scheme: icos_instruments
broader: SNOW-Microsonic mic+600
created: 2025-04-17T18:25:36

Microsonic mic+600/IU/TC
type: Concept
in scheme: icos_instruments
broader: SNOW-Microsonic mic+600
created: 2025-04-17T18:25:55

Microsonic mic+600/IU/TC/E
type: Concept
in scheme: icos_instruments
broader: SNOW-Microsonic mic+600
created: 2025-04-17T18:26:19

Microsonic mic+600/DIU/TC
type: Concept
in scheme: icos_instruments
broader: SNOW-Microsonic mic+600
created: 2025-04-17T18:26:40

Microsonic mic+600/DIU/TC/E
type: Concept
in scheme: icos_instruments
broader: SNOW-Microsonic mic+600
created: 2025-04-17T18:26:54

Microsonic mic+600/DDIU/TC
type: Concept
in scheme: icos_instruments
broader: SNOW-Microsonic mic+600
created: 2025-04-17T18:27:06

Microsonic
type: Collection
created: 2025-04-17T18:43:47
member: SNOW-Microsonic mic+600
member: Microsonic mic+600/D/TC
member: Microsonic mic+600/D/TC/E
member: Microsonic mic+600/DD/TC
member: Microsonic mic+600/DD/TC/E
member: Microsonic mic+600/DDIU/TC
member: Microsonic mic+600/DIU/TC
member: Microsonic mic+600/DIU/TC/E
member: Microsonic mic+600/E/TC
modified: 2025-04-17T18:44:32
member: Microsonic mic+600/EE/TC
member: Microsonic mic+600/F/TC
member: Microsonic mic+600/IU/TC
member: Microsonic mic+600/IU/TC/E

SNOW-SOMMER USH-9
type: Concept
in scheme: icos_instruments
broader: SNOW-Acoustic
created: 2025-04-17T18:45:22
alternative label: Snow depth (acoustic), SOMMER Messtechnik, USH-9
modified: 2025-04-17T18:45:40

SOMMER Messtechnik
type: Collection
created: 2025-04-17T18:46:55
member: SNOW-SOMMER USH-9
modified: 2025-04-17T18:47:29

dendrometers
type: Concept
in scheme: icos_instruments
broader: instrument type
created: 2025-04-17T18:55:52

DEN-Other
type: Concept
in scheme: icos_instruments
broader: dendrometers
created: 2025-04-17T18:56:07
definition: BADM Standard shortname for Dendrometer - Other
modified: 2025-05-02T17:37:25

DBH-Ecomatik DCX
type: Concept
in scheme: icos_instruments
broader: DEN-Other
created: 2025-04-17T18:56:18
alternative label: Diameter Breast Height, Ecomatik, DC family
definition: BADM ICOS shortname for Circumference Breast Height (band dendrometer), DC family (includes DC1, DC2 and DC3) produced by Ecomatik
modified: 2025-05-02T17:39:36

Ecomatik DC1
type: Concept
in scheme: icos_instruments
broader: DBH-Ecomatik DCX
created: 2025-04-17T18:57:15
definition: BADM ICOS shortname: DBH-Ecomatik DCX
definition: BADM Standard shortname: DBH-Other
definition: Circumference Breast Height (band dendrometer), Ecomatik, DC1
modified: 2025-05-02T17:43:26

Ecomatik DC2
type: Concept
in scheme: icos_instruments
broader: DBH-Ecomatik DCX
created: 2025-04-17T18:57:34

Ecomatik DC3
type: Concept
in scheme: icos_instruments
broader: DBH-Ecomatik DCX
created: 2025-04-17T18:57:47

Ecomatik
type: Collection
created: 2025-04-17T18:58:03
member: DBH-Ecomatik DCX
member: Ecomatik DC1
member: Ecomatik DC2
member: Ecomatik DC3
modified: 2025-04-17T19:00:09

DBH-EMS DRx26x
type: Concept
in scheme: icos_instruments
broader: DEN-Other
created: 2025-04-17T19:00:32
alternative label: Diameter Breast Height, EMS Brno, DR family
definition: Diameter Breast Height, EMS Brno, DR family (includes all the DR26 versions)
alternative label: EMS DR26
alternative label: EMS DRL26
modified: 2025-05-02T18:01:28

EMS DRS26
type: Concept
in scheme: icos_instruments
broader: DBH-EMS DRx26x
created: 2025-04-17T19:01:48

EMS DRL26D
type: Concept
in scheme: icos_instruments
broader: DBH-EMS DRx26x
created: 2025-04-17T19:02:08

EMS Environmental Measuring Systems Brno
type: Collection
created: 2025-04-17T19:03:15
member: DBH-EMS DRx26x
modified: 2025-04-17T19:05:10
member: EMS DRL26D
member: EMS DRS26

DL-InSitu ISDL3
type: Concept
in scheme: icos_instruments
broader: data loggers
created: 2025-04-18T12:53:16
alternative label: Datalogger, InSitu, ISDL-3
modified: 2025-04-18T12:53:34

DL-LI-COR SFlux2
type: Concept
in scheme: icos_instruments
broader: data loggers
created: 2025-04-18T13:00:05
alternative label: Datalogger, LI-COR, SmartFlux2
modified: 2025-04-18T13:00:21

DL-LI-COR SFlux3
type: Concept
in scheme: icos_instruments
broader: data loggers
created: 2025-04-18T13:00:34
alternative label: Datalogger, LI-COR, SmartFlux3
modified: 2025-04-18T13:00:53

DL-Other
type: Concept
in scheme: icos_instruments
broader: data loggers
created: 2025-04-18T13:01:07
definition: Datalogger, Other companies and models
modified: 2025-04-18T13:02:04

DL-PC
type: Concept
in scheme: icos_instruments
broader: data loggers
created: 2025-04-18T13:02:22
definition: Datalogger, Personal computers and micro-computers
modified: 2025-04-18T13:02:40

DL-Vaisala QML201
type: Concept
in scheme: icos_instruments
broader: data loggers
created: 2025-04-18T13:02:51
alternative label: Datalogger, Vaisala, QML201 series
modified: 2025-04-18T13:03:06

Los Gatos Research AAQC-914
type: Concept
in scheme: icos_instruments
created: 2025-04-18T16:18:05
scope note: LGR’s Ammonia Analyzer - Trace provides extremely fast (5 Hz response) and sensitive measurements of ammonia (and water vapor) in ambient air with high precision (0.2 ppb in 1 second). LGR’s Ammonia Analyzer - Trace provides measurements at 5 Hz with sub-ppb precision. In addition, the AAT can report measurements over a very wide range of concentrations and while in flight. The AAT use LGR’s patented Off-axis ICOS technology, a fourth generation cavity enhanced absorption technique along with mid-infrared quantum cascade laser.
broader: Cavity Enhanced Absorption Spectrometer (CEAS)
definition: Gas Analyzer (Closed Path), Los Gatos Research, Enhanced Performance Trace Ammonia Analyzer (NH3, H2O) AAQC-914 (ref. code 914-0013-0000-0000)
modified: 2025-07-26T17:38:20

Los Gatos Research AMA-911 (former name MAA-911-0023)
type: Concept
in scheme: icos_instruments
created: 2025-04-18T16:56:06
scope note: LGR’s Methane/Acetylene Analyzer is an instrument for simultaneous measurements of methane, acetylene and water vapor. The analyzer uses LGR’s patented technology, a fourth-generation cavity enhanced absorption technique
definition: Gas Analyzer (Closed Path), Los Gatos Research, Enhanced Performance Methane / Acetylene Analyzer (CH4, C2H2, H2O) AMA-911 (former name MAA-911-0023, ref. code 911-0023-0000-0000)
broader: Cavity Enhanced Absorption Spectrometer (CEAS)
modified: 2025-07-26T17:43:45

Los Gatos Research CCQC-913 (former name CCQC-913-0025/0029)
type: Concept
in scheme: icos_instruments
created: 2025-04-18T16:57:19
broader: Cavity Enhanced Absorption Spectrometer (CEAS)
definition: Gas Analyzer (Closed Path), Los Gatos Research, Enhanced Performance Carbon Monoxide Analyzer (CO, CO2, H2O) CCQC-913 (former name CCQC-913-0025/0029, ref. code 913-0025-0000-0000, 913-0029-0000-0000)
modified: 2025-07-26T17:16:52

Los Gatos Research CCQC-916
type: Concept
in scheme: icos_instruments
created: 2025-04-18T17:00:13
scope note: LGR's CO/CO2 Analyzer simultaneously measures ambient levels of carbon monoxide, carbon dioxide and water vapor. The CO/CO2 Analyzer is designed for demanding applications including trace-gas monitoring, eddy correlation flux measurements, chamber flux measurements, engine exhaust, flight studies and combustion diagnostics. The CO/CO2 Analyzer uses LGR's patented Off-axis ICOS technology, the fourth-generation cavity enhanced absorption technique.
definition: Gas Analyzer (Closed Path), Los Gatos Research, Performance Carbon Monoxide / Carbon Dioxide Analyzer (CO, CO2, H2O) CCQC-916 (ref. code 916-0029-0000-0000)
broader: Cavity Enhanced Absorption Spectrometer (CEAS)
modified: 2025-07-26T18:04:37

Los Gatos Research CDA-907
type: Concept
in scheme: icos_instruments
created: 2025-04-18T17:01:53
scope note: The Los Gatos Research (LGR) Carbon Dioxide Analyzer (CDA) provides measurements of carbon dioxide (CO2) and water vapor (H2O) simultaneously The Analyzer uses LGR’s patented Off-Axis ICOS technology, a fourth-generation cavity enhanced absorption technique.
definition: Gas Analyzer (Closed Path), Los Gatos Research, Carbon Dioxide Analyzer (CO2, H2O) CDA-907-0002. Discontinued, replaced with CO2-911
broader: Cavity Enhanced Absorption Spectrometer (CEAS)
modified: 2025-07-26T18:08:53

Los Gatos Research CH4-911 (former name FMA-911-0001)
type: Concept
in scheme: icos_instruments
created: 2025-04-18T17:03:04
broader: Cavity Enhanced Absorption Spectrometer (CEAS)
scope note: LGR’s Fast Methane Analyzer (FMA) provides extremely precise measurements of methane (CH4) and water vapor at up to 20 Hz. In addition to accurately monitoring typical ambient methane levels, the unprecedented response of LGR’s FMA allows measurements at high mole fractions (to 1000ppm with extended range option) for applications including landfills, peatlands and chamber studies. LGR’s patented technology, a fourth-generation cavity enhanced absorption technique, has many advantages (simpler, easier to build, rugged) over older, conventional cavity ringdown spectroscopy (CRDS) techniques.
definition: Gas Analyzer (Closed Path), Los Gatos Research, Enhanced Performance Fast Methane Analyzer (CH4, H2O) CH4-911 (former name FMA-911-0001, ref. code 911-0001-0000-0000)
modified: 2025-07-22T20:04:16

Los Gatos Research FMA-907
type: Concept
in scheme: icos_instruments
created: 2025-04-18T17:07:08
scope note: LGR’s Fast Methane Analyzer (FMA) provides measurements of methane (CH4) and water vapor at up to 20 Hz. FMA Analyzer uses LGR’s patented technology, a fourth-generation cavity enhanced absorption technique.
definition: Gas Analyzer (Closed Path), Los Gatos Research, Fast Methane Analyzer (CH4, H2O) FMA-907-0001 (ref. code 907-0001-0000-0000). Discontinued, replaced with CH4-911
broader: Cavity Enhanced Absorption Spectrometer (CEAS)
modified: 2025-07-26T18:09:13

Los Gatos Research GGA-907
type: Concept
in scheme: icos_instruments
created: 2025-04-18T17:08:52
scope note: LGR’s Greenhouse Gas Analyzer is an instrument for simultaneous measurements of methane, carbon dioxide and water vapor. GGA Analyzer uses LGR’s patented technology, a fourth-generation cavity enhanced absorption technique.
definition: Gas Analyzer (Closed Path), Los Gatos Research, Greenhouse Gas Analyzer (CH4, CO2, H2O) GGA-907-0010. Discontinued, replaced with GGA-911
broader: Cavity Enhanced Absorption Spectrometer (CEAS)
modified: 2025-07-26T18:09:18

Los Gatos Research GGA-911 (former name GGA-911-0010)
type: Concept
in scheme: icos_instruments
created: 2025-04-18T17:10:39
scope note: Model 911-0010 Fast Enhanced-Performance Greenhouse Gas Analyzer (FGGA-24EP) – Simultaneous measurements of methane, carbon dioxide, and water vapor mole fractions (concentrations) continuously in flowing gas samples. It includes LGR’s enhanced thermal stability technology that provides ultra-stable minimal-drift measurements in a rackmount package.
broader: Cavity Enhanced Absorption Spectrometer (CEAS)
definition: Gas Analyzer (Closed Path), Los Gatos Research, Enhanced Performance Greenhouse Gas Analyzer (CH4, CO2, H2O) GGA-911 (former name GGA-911-0010, ref. code 911-0011-0000-0000)
modified: 2025-07-22T20:20:01

Los Gatos Research M-GGA-918
type: Concept
in scheme: icos_instruments
created: 2025-04-18T17:12:12
scope note: The M-GGA-918 microportable gas analyzers reports measurements of methane, carbon dioxide and water vapor simultaneously. M-GGA-918 analyzer uses LGR’s patented OA-ICOS technology, a fourth-generation cavity enhanced absorption technique.
definition: Gas Analyzer (Closed Path), Los Gatos Research, Greenhouse Gas Analyzers (CH4, CO2, H2O), Microportable 2 lasers, M-GGA-918 (ref. code 918-0011-0000-0000)
broader: Cavity Enhanced Absorption Spectrometer (CEAS)
modified: 2025-07-26T18:09:22

Los Gatos Research M-GPC-918
type: Concept
in scheme: icos_instruments
created: 2025-04-18T17:18:06
scope note: The M-GPC-918 microportable gas analyzers reports measurements of methane, carbon dioxide and water vapor simultaneously.M-GPC-918 uses LGR’s patented OA-ICOS technology, a fourth-generation cavity enhanced absorption technique.
definition: Gas Analyzer (Closed Path), Los Gatos Research, Greenhouse Gas Analyzers (CH4, CO2, H2O), Microportable 1 laser, M-GPC-918 (ref. code 918-0001-0000-0000)
broader: Cavity Enhanced Absorption Spectrometer (CEAS)
modified: 2025-07-26T18:09:27

Los Gatos Research MAA-907
type: Concept
in scheme: icos_instruments
created: 2025-04-18T17:27:00
scope note: LGR’s Methane/Acetylene Analyzer is an instrument for simultaneous measurements of methane, acetylene and water vapor. The analyzer uses LGR’s patented technology, a fourth-generation cavity enhanced absorption technique.
definition: Gas Analyzer (Closed Path), Los Gatos Research, Methane/Acetylene Analyzer (CH4, C2H2, H2O) MAA-907-0023 (ref.coed 907-0023-0000-0000). Discontinued, replaced with AMA-911
broader: Cavity Enhanced Absorption Spectrometer (CEAS)
modified: 2025-07-26T18:09:31

Los Gatos Research MCEA1-911
type: Concept
created: 2025-04-18T17:28:00
definition: Gas Analyzer (Closed Path), Los Gatos Research, Enhanced Performance Carbon Monoxide / Carbon Dioxide / Methane Analyzer (CH4, CO, CO2, H2O) MCEA-911 (ref. code 911-0059-0000-0000)
broader: Cavity Enhanced Absorption Spectrometer (CEAS)
modified: 2025-07-26T18:09:43

Los Gatos Research MCEA1-927
type: Concept
in scheme: icos_instruments
created: 2025-04-18T17:30:49
definition: Gas Analyzer (Closed Path), Los Gatos Research, Performance Carbon Monoxide / Carbon Dioxide / Methane Analyzer (CH4, CO, CO2, H2O) MCEA-927 (ref. code 927-0059-0000-0000)
broader: Cavity Enhanced Absorption Spectrometer (CEAS)
modified: 2025-07-26T18:09:47

Los Gatos Research N2OCM-913 (former name N2OCM-913-0014/0015)
type: Concept
in scheme: icos_instruments
created: 2025-04-18T17:33:01
scope note: The N2O/CO Analyzer is designed for many demanding applications including trace gas monitoring, eddy-correlation flux measurements, chamber flux measurements, and engine exhaust measurements. The Analyzer is particularly well suited for measurements in the field and has been successfully deployed on-board NASA DC-8 aircraft for measurements in the upper troposphere / lower stratosphere. The N2O/CO Analyzer is essentially unaffected by other atmospheric gases or changes in pressure. The Analyzer uses LGR’s patented Offaxis ICOS technology, a fourth-generation cavity enhanced absorption technique. Off-axis ICOS has many advantages over conventional first-generation Cavity Ringdown Spectroscopy (CRDS) techniques such as being alignment insensitive, having a much shorter measurement time, and not requiring expensive and power consuming auxiliary components.
broader: Cavity Enhanced Absorption Spectrometer (CEAS)
definition: Gas Analyzer (Closed Path), Los Gatos Research, Enhanced Performance Nitrous Oxide / Carbon Monoxide Analyzer (N2O, CO, H2O) N2OCM-913 (former name N2OCM-913-0014/0015, ref. code 913-0015-0000-0000 )
modified: 2025-07-26T17:11:56

Los Gatos Research N2OCM-916
type: Concept
in scheme: icos_instruments
created: 2025-04-18T17:34:21
definition: Gas Analyzer (Closed Path), Los Gatos Research, Performance Nitrous Oxide / Carbon Monoxide Analyzer (N2O, CO, H2O) N2OCM-916 (ref. code 916-0015-0000-0000)
broader: Cavity Enhanced Absorption Spectrometer (CEAS)
modified: 2025-07-26T18:09:52

Los Gatos Research N2OM1-913
type: Concept
in scheme: icos_instruments
created: 2025-04-18T17:40:59
alternative label: Gas Analyzer, Closed Path, Los Gatos Research 913-1054 for N2O/CH4/H2O
scope note: LGR’s CH4/N2O Analyzer is capable of measuring ambient levels of both N2O and CH4 with high precision in real time with data rates up to 10 Hz. In addition, the analyzer reports water vapor mole fraction simultaneously and reports dry N2O and CH4 mole fractions without the need for sample drying. The Analyzer uses LGR’s patented Offaxis ICOS technology, a fourth-generation cavity enhanced absorption technique. Off-axis ICOS has many advantages over conventional first-generation Cavity Ringdown Spectroscopy (CRDS) techniques such as being alignment insensitive, simple to service, having a much shorter measurement time, and not requiring expensive and power consuming auxiliary components.
definition: BADM Standard shortname for Gas Analyzer, Closed Path, Los Gatos Research 913-1054 for N2O/CH4/H2O
broader: Cavity Enhanced Absorption Spectrometer (CEAS)
modified: 2025-07-26T17:20:19

Open-path gas analyzer
type: Concept
in scheme: icos_instruments
broader: gas analyzers
created: 2025-05-12T18:33:09
modified: 2025-05-28T19:51:09

Closed-path gas analyzers
type: Concept
in scheme: icos_instruments
broader: gas analyzers
created: 2025-05-12T18:35:35
modified: 2025-05-23T15:45:58

Campbell Scientific IRGASON
type: Concept
in scheme: icos_instruments
created: 2025-05-12T18:47:38
scope note: The IRGASON, U.S. Des. Patent No. D680455, is an in situ, open-path, mid-infrared absorption gas analyzer integrated with a three-dimensional sonic anemometer. The gas analyzer provides measurements of absolute densities of carbon dioxide and water vapor, while the sonic anemometer measures orthogonal wind components.
definition: Gas Analyzer (Open Path) and Sonic Anemometer, Campbell Scientific, IRGASON.
broader: Open-path infrared gas analyzers (IRGA)
modified: 2025-07-26T18:38:24

Closed-path infrared gas analyzer (IRGA)
type: Concept
in scheme: icos_instruments
created: 2025-05-23T12:57:23
broader: Closed-path gas analyzers
modified: 2025-05-23T14:51:31

Quantum Cascade Laser spectrometer (QCL)
type: Concept
in scheme: icos_instruments
created: 2025-05-23T13:24:44
broader: Closed-path infrared gas analyzer (IRGA)
modified: 2025-05-23T16:20:19

Tunable Diode Laser Absorption Spectrometer (TDLAS)
type: Concept
in scheme: icos_instruments
broader: Closed-path infrared gas analyzer (IRGA)
created: 2025-05-23T15:04:06
definition: Instrument that determines the concentration of a compounds by its absorption of laser light from a laser whose wavelength is modified.
modified: 2025-05-23T15:52:56

Cavity Enhanced Absorption Spectrometer (CEAS)
type: Concept
in scheme: icos_instruments
created: 2025-05-23T15:35:24
definition: Cavity-Enhanced Absorption Spectroscopy (CEAS) is a highly sensitive technique that improves upon conventional absorption spectroscopy by using a highly reflective optical cavity. This cavity confines light, increasing the interaction with absorbing molecules and enabling the detection of weak absorptions that would be difficult to see with standard methods.
broader: Closed-path infrared gas analyzer (IRGA)
modified: 2025-05-23T15:51:22

Los Gatos Research OCS-914
type: Concept
in scheme: icos_instruments
broader: Cavity Enhanced Absorption Spectrometer (CEAS)
created: 2025-05-27T17:25:34
scope note: LGR’s OCS Analyzer (carbonyl sulfide) reports OCS and CO2 simultaneously at ambient levels with extremely high precision. In addition, the OCS Analyzer also measures carbon monoxide (CO), and water vapor (H2O) to allow for reporting on a dry mole fraction basis without the need for sample drying, or any post correction procedure. The Analyzer uses LGR’s patented Off-axis ICOS technology, a fourth-generation cavity enhanced absorption technique.
definition: Gas Analyzer (Closed Path), Los Gatos Research, Enhanced Performance Carbonyl Sulfide Analyzer (OCS, CO2, CO, H2O) OCS-914 (ref. code 914-0028-0000-0000)
modified: 2025-07-26T17:31:09

Los Gatos Research RMT-200
type: Concept
in scheme: icos_instruments
broader: Cavity Enhanced Absorption Spectrometer (CEAS)
created: 2025-05-27T17:47:31
definition: Gas Analyzer (Closed Path), Los Gatos Research, Fast Methane Analyzer (CH4) RMT-200. Discontinued
modified: 2025-07-26T17:40:20

Los Gatos Research
type: Collection
created: 2025-05-27T19:41:18
member: Los Gatos Research RMT-200
member: Los Gatos Research N2OCM-916
member: Los Gatos Research MCEA1-927
member: Los Gatos Research MCEA1-911
member: Los Gatos Research MAA-907
member: Los Gatos Research M-GPC-918
member: Los Gatos Research M-GGA-918
member: Los Gatos Research GGA-907
member: Los Gatos Research FMA-907
member: Los Gatos Research CDA-907
member: Los Gatos Research CCQC-916
member: Los Gatos Research AMA-911 (former name MAA-911-0023)
member: Los Gatos Research AAQC-914
member: Los Gatos Research OCS-914
member: Los Gatos Research N2OM1-913
member: Los Gatos Research CCQC-913 (former name CCQC-913-0025/0029)
member: Los Gatos Research N2OCM-913 (former name N2OCM-913-0014/0015)
member: Los Gatos Research GGA-911 (former name GGA-911-0010)
member: Los Gatos Research CH4-911 (former name FMA-911-0001)
member: Los Gatos Research U-MCEA1-915
member: Los Gatos Research OXCD-911 (former name OCO-911-0035)
modified: 2025-05-28T19:36:16
member: Los Gatos Research NOCD-916 (former name NOA-916-0047)
member: Los Gatos Research NOCD-913 (former name NOA-913-0047)
member: Los Gatos Research N2OM1-916

Los Gatos Research N2OM1-916
type: Concept
in scheme: icos_instruments
created: 2025-05-28T17:45:04
scope note: LGR's CH4/N2O Analyzer (Methane and Nitrous Oxide Analyzer) continuously measures ambient levels of methane and nitrous oxide simultaneously in real time with data rates and flow response rates as fast as 10 Hz. The CH4/N2O Analyzer uses LGR's patented Off-axiz ICOS technology, the fourth-generation cavity enhamced absorption technique, wich employs a high-finesse optical cavity as the measurement cell.
definition: Gas Analyzer (Closed Path), Los Gatos Research, Performance Methane / Nitrous Oxide Analyzer (CH4, N2O, H2O) N2OM1-916 (ref. code 916-0055-0000-0000)
broader: Cavity Enhanced Absorption Spectrometer (CEAS)
modified: 2025-07-26T18:09:56

Los Gatos Research NOCD-913 (former name NOA-913-0047)
type: Concept
in scheme: icos_instruments
created: 2025-05-28T17:51:02
definition: Gas Analyzer (Closed Path), Los Gatos Research, Enhanced Performance Nitric Oxide / Carbon Dioxide Analyzer (NO, CO2, H2O) NOCD-913 (former name NOA-913-0047, ref. code 913-0047-0000-0000)
broader: Cavity Enhanced Absorption Spectrometer (CEAS)
modified: 2025-07-26T18:10:03

Los Gatos Research NOCD-916 (former name NOA-916-0047)
type: Concept
in scheme: icos_instruments
created: 2025-05-28T18:16:32
definition: Gas Analyzer (Closed Path), Los Gatos Research, Performance Nitric Oxide / Carbon Dioxide Analyzer (NO, CO2, H2O) NOCD-916 (ref. code 916-0047-0000-0000)
broader: Cavity Enhanced Absorption Spectrometer (CEAS)
modified: 2025-07-26T18:10:08

Los Gatos Research OXCD-911 (former name OCO-911-0035)
type: Concept
in scheme: icos_instruments
created: 2025-05-28T18:17:37
scope note: LGR’s O2/CO2 Analyzer is capable of reporting oxygen, carbon dioxide and water vapor in air with extremely high precision and fast response. Designed for measurements in ambient air for applications requiring high precision, the O2/CO2 Analyzer applies LGR’s proven cavity enhanced laser absorption spectroscopy technique for simultaneous continuous measurements of these three important atmospheric gases. The O2/CO2 uses LGR’s patented technology, a fourth-generation cavity enhanced absorption technique.
definition: Gas Analyzer (Closed Path), Los Gatos Research, Enhanced Performance Oxygen / Carbon Dioxide Analyzer (O2, CO2, H2O) OXCD-911 (former name OCO-911-0035, ref. code 911-0035-0000-0000)
broader: Cavity Enhanced Absorption Spectrometer (CEAS)
modified: 2025-07-26T18:10:13

Los Gatos Research U-MCEA1-915
type: Concept
in scheme: icos_instruments
created: 2025-05-28T18:43:13
scope note: LGR Ultraportable U-MCEA-915 is capable of reporting simultaneous and continuous measurements of carbon monoxide, carbon dioxide, methane and water vapour in air flow, using patented Off-Axis Integrated Cavity Output Spectroscopy (OA-ICOS) technology
definition: Gas Analyzer (Closed Path), Los Gatos Research, Multi-gas Carbon Emissions Gas Analyzer, Ultraportable (CH4, CO, CO2, H2O) U-MCEA1-915 (ref. code 915-0059-0000-0000)
broader: Cavity Enhanced Absorption Spectrometer (CEAS)
modified: 2025-07-26T18:10:18

Closed-path nondispersive infrared gas analyzer (NDIR)
type: Concept
in scheme: icos_instruments
broader: Closed-path infrared gas analyzer (IRGA)
created: 2025-05-28T19:38:42
modified: 2025-05-28T19:49:57

Open-path nondispersive infrared gas analyzer (NDIR)
type: Concept
in scheme: icos_instruments
created: 2025-05-28T19:50:34
broader: Open-path infrared gas analyzers (IRGA)
modified: 2025-06-05T10:01:30

LI-COR LI-7000
type: Concept
in scheme: icos_instruments
created: 2025-05-28T19:57:01
broader: Closed-path nondispersive infrared gas analyzer (NDIR)
scope note: The LI-7000 is a differential, non-dispersive, infrared (NDIR) gas analyzer. The CO2 and H2O measurements are based on the difference in absorption of infrared (IR) radiation passing through two gas sampling cells. Cell A (normally the reference cell) is used for a gas of known CO2 or H2O concentration, and Cell B (normally the sample cell) is used for a gas of unknown concentration. Infrared radiation is transmitted through both cell paths, and the radiation at the detectors is measured in both cells and used to compute absorption
definition: Gas Analyzer (Closed Path), LI-COR LI-7000
modified: 2025-07-26T18:22:21

LI-COR LI-6252
type: Concept
in scheme: icos_instruments
broader: Closed-path nondispersive infrared gas analyzer (NDIR)
created: 2025-06-03T11:09:00
scope note: The LI-6252 is a differential, non-dispersive, infrared (NDIR) gas analyzer. The CO2 measurements are based on the difference in absorption of infrared (IR) radiation passing through two gas sampling cells. The reference cell is used for a gas of known CO2 concentration, and the sample cell is used for a gas of unknown concentration. Infrared radiation is transmitted through both cell paths, and the output of the analyzer is proportional to the difference in absorption between the two.
definition: Gas Analyzer (Closed Path), LI-COR LI-6252
modified: 2025-07-26T18:21:32

LI-COR LI-6262
type: Concept
in scheme: icos_instruments
broader: Closed-path nondispersive infrared gas analyzer (NDIR)
created: 2025-06-03T11:12:03
scope note: The LI-6262 is a differential, non-dispersive, infrared (NDIR) gas analyzer. The CO 2 and H 2O measurements are based on the difference in absorption of infrared (IR) radiation passing through two gas sampling cells. The reference cell is used for a gas of known CO2 or H2O concentration, and the sample cell is used for a gas of unknown concentration. Infrared radiation is transmitted through both cell paths, and the output of the analyzer is proportional to the difference in absorption between the two.
definition: Gas Analyzer (Closed Path), LI-COR LI-6262
modified: 2025-07-26T18:22:00

MIRO Analytical
type: Collection
created: 2025-06-03T17:10:24
member: MIRO MGA3-GHG
member: MIRO MGA5-GHG
member: MIRO MGA6-GHG
member: MIRO MGA7-GHG
member: MIRO MGA8-GHG
modified: 2025-07-22T19:34:13

Cavity Ring Down Spectroscopy analyzers (CRDS)
type: Concept
in scheme: icos_instruments
broader: Closed-path infrared gas analyzer (IRGA)
created: 2025-06-05T08:49:23

Picarro G1301-f
type: Concept
in scheme: icos_instruments
broader: Cavity Ring Down Spectroscopy analyzers (CRDS)
created: 2025-06-05T08:49:50
scope note: G1301 trace gas analyzers use optical absorption spectroscopy of the target gases to determine concentration. They are based on cavity ring down spectroscopy (CRDS), a technology in which light re-circulates many times through the sample, creating a very long effective path length for the light to interact with the sample - thus enabling excellent detection sensitivity in a compact and rugged instrument.
definition: Gas Analyzer (Closed Path), Picarro, G1301-f CO2, CH4, and H2O
modified: 2025-07-26T18:15:50

Picarro G2301-f
type: Concept
in scheme: icos_instruments
broader: Cavity Ring Down Spectroscopy analyzers (CRDS)
created: 2025-06-05T08:55:29
scope note: Picarro analyzers use time-based, optical absorption spectroscopy of the target gases to determine concentration. They are based on wavelength-scanned cavity ring-down spectroscopy (WS-CRDS), a technology in which light re-circulates many times through the sample, creatinga very long effective path length for the light to interact with the sample, thus, enabling excellent detection sensitivity in a compact and rugged instrument.
definition: Gas Analyzer (Closed Path), Picarro, G2301-f CO2, CH4, and H2O
modified: 2025-07-26T18:17:04

Picarro G2311-f
type: Concept
in scheme: icos_instruments
broader: Cavity Ring Down Spectroscopy analyzers (CRDS)
created: 2025-06-05T08:59:51
scope note: Picarro analyzers use time-based, optical absorption spectroscopy of the target gases to determine concentration. They are based on wavelength-scanned cavity ring-down spectroscopy (WS-CRDS), a technology in which light re-circulates many times through the sample, creating a very long effective path length for the light to interact with the sample, thus, enabling excellent detection sensitivity in a compact and rugged instrument.
definition: Gas Analyzer (Closed Path), Picarro, G2311-f CO2, CH4, and H2O
modified: 2025-07-26T18:18:04

Flow controller, module and pump
type: Concept
in scheme: icos_instruments
broader: gas analyzers
created: 2025-06-05T09:13:59
modified: 2025-07-26T19:06:18

Other models of flow controller for LI-7200
type: Concept
in scheme: icos_instruments
broader: Flow controller, module and pump
created: 2025-06-05T09:14:17
definition: Flow controller, non-LI-COR controller if LI-7200-101 is not used
modified: 2025-07-26T18:29:03

Picarro
type: Collection
created: 2025-06-05T09:17:20
member: Picarro G1301-f
member: Picarro G2301-f
member: Picarro G2311-f
member: Picarro G2401
modified: 2025-07-26T19:52:31

LI-COR LI-7200-101 Flow Module
type: Concept
in scheme: icos_instruments
broader: Flow controller, module and pump
created: 2025-06-05T09:30:30
definition: Flow module, LI-COR, LI-7200-101
modified: 2025-07-26T18:29:55

LI-COR LI-7200-102 Flow Module
type: Concept
in scheme: icos_instruments
broader: Flow controller, module and pump
created: 2025-06-05T09:40:22
definition: Flow module, LI-COR, LI-7200-102
modified: 2025-07-26T18:30:34

Open-path infrared gas analyzers (IRGA)
type: Concept
in scheme: icos_instruments
broader: Open-path gas analyzer
created: 2025-06-05T09:59:30

LI-COR LI-7500
type: Concept
in scheme: icos_instruments
broader: Open-path nondispersive infrared gas analyzer (NDIR)
created: 2025-06-05T10:06:44
scope note: The LI-7500 is a high performance, non-dispersive, open path infrared CO 2 /H2 O analyzer designed for use in eddy covariance flux measurement systems. Some of the LI-7500's important features include simultaneous measurements of CO2 and H2O in the free atmosphere and high speed measurements.
definition: Gas Analyzer (Open Path), LI-COR, LI-7500
modified: 2025-07-26T18:40:11

LI-COR LI-7500A
type: Concept
in scheme: icos_instruments
broader: Open-path nondispersive infrared gas analyzer (NDIR)
created: 2025-06-05T10:14:54
definition: Gas Analyzer (Open Path), LI-COR, LI-7500A
modified: 2025-07-26T18:40:42

List of terms for BADM Standards
type: Collection
created: 2025-06-30T12:49:24
member: WTD-Press
member: WTD-Float
member: WTD-Manual
member: WTD-Other
member: GA_CP-Aerodyne
member: GA_CP-Campbell TGA100
member: GA_CP-Campbell TGA200A
member: GA_CP-Campbell EC155
member: GA_CP-LGR RMT-200
member: GA_CP-LGR 911-0001
member: GA_CP-LGR 911-0010
member: GA_CP-LGR 911-0020
member: GA_CP-LGR 913-0014
member: GA_CP-LGR 913-0029
member: GA_CP-LGR 913-1054
member: GA_CP-LGR 914-0028
member: GA_CP-LGR 914-1012
member: GA_CP-LGR Other
member: GA_CP-LI-COR LI-6252
member: GA_CP-LI-COR LI-6262
member: GA_CP-LI-COR LI-7000
member: GA_CP-LI-COR LI-7200
member: GA_CP-LI-COR LI-7200RS
member: GA_CP-Picarro G1301-f
member: GA_CP-Picarro G2301-f
member: GA_CP-Picarro G2311-f
member: GA_CP-Picarro Other
member: GA_OP-Campbell EC150
member: GA_OP-LI-COR LI-7500
member: GA_OP-LI-COR LI-7500A
member: GA_OP-LI-COR LI-7500DS
member: GA_OP-LI-COR LI-7500RS
member: GA_OP-LI-COR LI-7700
member: GA_OP-Krypton Hygrometer
member: GA_OP-Lyman-alpha Hygrometer
member: GA_OP-Other
member: GA_SR-LI-COR LI-800
member: GA_SR-LI-COR LI-820
member: GA_SR-LI-COR LI-840
member: GA_SR-LI-COR LI-840A
member: GA_SR-LI-COR LI-8100
member: GA_SR-LI-COR LI-8100A
member: GA_SR-Picarro G2401
member: GA_SR-Other
member: GA_OP_SA-Campbell IRGASON
member: GA_OP_SA-Other
member: GA_CP_SA-Other
member: GA-Other
member: GA_AIU-LI-COR LI-7550
modified: 2025-07-08T19:16:31
member: GA_CP-Other
member: PRES-ElectBar
member: PRES-Other
member: MULTI-Meteo
member: PREC-OpticGauge
member: PREC-TipBucGauge

List of terms for ICOS BADM
type: Collection
created: 2025-06-30T13:15:05
member: WTD-Baumer ED752
member: WTD-BD LMPx0x(x)
member: WTD-Campbell CS45X
member: GA_AIU-LI-COR LI-7550
member: GA_CP-Aerodyne DualQCL
member: GA_CP-Aerodyne MiniQCL
member: GA_CP-Campbell EC155
member: GA_CP-Campbell TGA100
member: GA_CP-Campbell TGA200A
member: GA_CP-LI-COR LI-6252
member: GA_CP-LI-COR LI-6262
member: GA_CP-LI-COR LI-7000
member: GA_CP-LI-COR LI-7200
member: GA_CP-LI-COR LI-7200RS
member: GA_CP-Picarro G1301-f
member: GA_CP-Picarro G2301-f
member: GA_CP-Picarro G2311-f
member: GA_OP_SA-Campbell IRGASON
member: GA_OP-Campbell EC150
member: GA_OP-LI-COR LI-7500
member: GA_OP-LI-COR LI-7500A
member: GA_OP-LI-COR LI-7500DS
member: GA_OP-LI-COR LI-7500RS
member: GA_OP-LI-COR LI-7700
member: GA_SR-LI-COR LI-800
member: GA_SR-LI-COR LI-820
member: GA_SR-LI-COR LI-840
member: GA_SR-LI-COR LI-840A
member: GA_SR-LI-COR LI-8100
member: GA_SR-LI-COR LI-8100A
member: GA_SR-Picarro G2401
member: GA_CP-LGR RMT-200
modified: 2025-07-08T19:14:10
member: GA_CP-LGR AAQC-914
member: GA_CP-LGR AMA-911
member: GA_CP-LGR CCQC-913
member: GA_CP-LGR CCQC-916
member: GA_CP-LGR CDA-907
member: GA_CP-LGR CH4-911
member: GA_CP-LGR CO2-911
member: GA_CP-LGR FMA-907
member: GA_CP-LGR GGA-907
member: GA_CP-LGR GGA-911
member: GA_CP-LGR M-GGA-918
member: GA_CP-LGR M-GPC-918
member: GA_CP-LGR MAA-907
member: GA_CP-LGR MCEA1-911
member: GA_CP-LGR MCEA1-927
member: GA_CP-LGR N2OCM-913
member: GA_CP-LGR N2OCM-916
member: GA_CP-LGR N2OM1-913
member: GA_CP-LGR N2OM1-916
member: GA_CP-LGR NOCD-913
member: GA_CP-LGR NOCD-916
member: GA_CP-LGR OCS-914
member: GA_CP-LGR OXCD-911
member: GA_CP-LGR U-MCEA1-915
member: GA_CP-MIRO MGAx-GHG
member: GA_CP-MIRO MGAx(x)-GP
member: GA_FLOW_CONTR-other
member: GA_FM-LI-COR LI-7200-101
member: GA_FM-LI-COR LI-7200-102
member: GA_FM-other
member: GA_PUMP-other
member: GA_SR-LI-COR LI-830
member: GA_SR-LI-COR LI-850
member: GA_SR-LI-COR LI-870
member: GA_SR-Sunburst SAMI CO2
member: GA_SR-Vaisala GMP343
member: PRES-Bosch BMPxxx
member: PRES-Campbell BaroVUE10
member: PRES-Campbell ClimaVUE50
member: PRES-CRESSTO SPA5x(x)
member: PRES-Druck DPI 26x
member: PRES-DeltaOhm HD9X08T(R)
member: PRES-Druck RPT410F
member: PRES-FirstSensor 144SCxxxxBARO

Baumer ED752 pressure transmitter
type: Concept
in scheme: icos_instruments
created: 2025-06-30T16:02:26
broader: water pressure sensors_2
definition: For ICOS-BADM users the shortname is WTD-Baumer ED752, for Standard BADM users the shortname is WTD-Press
modified: 2025-07-02T11:35:30

WTD-Baumer ED752
type: Collection
created: 2025-06-30T16:03:01
member: Baumer ED752 pressure transmitter
definition: Shortname used in ICOS BADM for Water Table Depth, Baumer, ED752
modified: 2025-07-22T19:27:20

WTD-BD LMPx0x(x)
type: Collection
created: 2025-06-30T16:03:25
member: BD Sensors LMP 305 pressure transmitter
member: BD Sensors LMP 307 pressure transmitter
member: BD Sensors LMP 307i pressure transmitter
member: BD Sensors LMP 307i RS-485 pressure transmitter
member: BD Sensors LMP 308 pressure transmitter
member: BD Sensors LMP 308i pressure transmitter
definition: Shortname used in ICOS BADM for Water Table Depth, BD Sensors, LMP series (includes LMP 305, LMP 307, LMP 307i RS-485, LMP 307i, LMP 307T, LMP 308, LMP 308i and LMP 808)
modified: 2025-07-22T19:27:43

WTD-Campbell CS45X
type: Collection
created: 2025-06-30T16:04:14
member: Campbell Scientific CS450 pressure transducer
member: Campbell Scientific CS451 pressure transducer
member: Campbell Scientific CS455 pressure transducer
member: Campbell Scientific CS456 pressure transducer
definition: Shortname used in ICOS BADM for Water Table Depth, Campbell Scientific, CS45X series (includes CS450, CS451, CS455 and CS456)
modified: 2025-07-22T19:28:08

BD Sensors LMP 305 pressure transmitter
type: Concept
in scheme: icos_instruments
created: 2025-06-30T16:07:50
definition: BADM ICOS: WTD-BD LMPx0x(x)
definition: BADM Standard: WTD-Press
broader: water pressure sensors_2
modified: 2025-07-02T11:35:55

BD Sensors LMP 307 pressure transmitter
type: Concept
in scheme: icos_instruments
created: 2025-06-30T16:08:01
definition: BADM ICOS: WTD-BD LMPx0x(x)
definition: BADM Standard: WTD-Press
broader: water pressure sensors_2
modified: 2025-07-02T11:36:21

BD Sensors LMP 307i pressure transmitter
type: Concept
in scheme: icos_instruments
created: 2025-06-30T16:08:18
definition: BADM ICOS: WTD-BD LMPx0x(x)
definition: BADM Standard: WTD-Press
broader: water pressure sensors_2
modified: 2025-07-02T11:36:33

BD Sensors LMP 307i RS-485 pressure transmitter
type: Concept
in scheme: icos_instruments
created: 2025-06-30T16:08:30
definition: BADM ICOS: WTD-BD LMPx0x(x)
definition: BADM Standard: WTD-Press
broader: water pressure sensors_2
modified: 2025-07-02T11:36:43

Campbell Scientific CS450 pressure transducer
type: Concept
in scheme: icos_instruments
created: 2025-06-30T16:08:46
definition: BADM ICOS: WTD-Campbell CS45X
definition: BADM Standard: WTD-Press
broader: water pressure sensors_2
modified: 2025-07-02T11:37:14

Campbell Scientific CS451 pressure transducer
type: Concept
in scheme: icos_instruments
created: 2025-06-30T16:09:13
definition: BADM Standard: WTD-Press
definition: BADM ICOS: WTD-Campbell CS45X
broader: water pressure sensors_2
modified: 2025-07-02T11:37:23

BD Sensors LMP 308 pressure transmitter
type: Concept
in scheme: icos_instruments
created: 2025-06-30T16:11:42
definition: BADM ICOS: WTD-BD LMPx0x(x)
definition: BADM Standard: WTD-BD LMPx0x(x)
broader: water pressure sensors_2
modified: 2025-07-02T11:36:50

BD Sensors LMP 308i pressure transmitter
type: Concept
in scheme: icos_instruments
created: 2025-06-30T16:11:55
definition: BADM ICOS: WTD-BD LMPx0x(x)
definition: BADM Standard: WTD-Press
broader: water pressure sensors_2
modified: 2025-07-02T11:37:00

Campbell Scientific CS455 pressure transducer
type: Concept
in scheme: icos_instruments
created: 2025-06-30T16:12:24
definition: BADM Standard: WTD-Press
definition: BADM ICOS: WTD-Campbell CS45X
broader: water pressure sensors_2
modified: 2025-07-02T11:37:33

Campbell Scientific CS456 pressure transducer
type: Concept
in scheme: icos_instruments
created: 2025-06-30T16:12:45
definition: sensor description
definition: BADM ICOS: WTD-Campbell CS45X
definition: BADM Standard: WTD-Press
broader: water pressure sensors_2
modified: 2025-07-02T11:37:41

WTD-Press
type: Collection
created: 2025-06-30T16:21:37
member: Baumer ED752 pressure transmitter
member: BD Sensors LMP 305 pressure transmitter
member: BD Sensors LMP 307 pressure transmitter
member: BD Sensors LMP 307i pressure transmitter
member: BD Sensors LMP 307i RS-485 pressure transmitter
member: BD Sensors LMP 308 pressure transmitter
member: BD Sensors LMP 308i pressure transmitter
member: Campbell Scientific CS450 pressure transducer
member: Campbell Scientific CS451 pressure transducer
member: Campbell Scientific CS455 pressure transducer
member: Campbell Scientific CS456 pressure transducer
definition: Shortname used in BADM Standards for Water table depth, pressure sensor
modified: 2025-07-22T19:19:45

Electronic barometer
type: Concept
in scheme: icos_instruments
broader: barometer
created: 2025-07-01T16:29:55

Manufacturer
type: Collection
created: 2025-07-07T19:53:48
member: Aerodyne Research
member: Amet
member: Apogee Instruments
member: Applied Technologies
member: ASAIR
member: Baumer
member: BD Sensors
member: Bosch
member: Campbell Scientific
member: Casella Solutions
member: CRESSTO
member: Davis Instruments
member: Delta Ohm
member: Delta-T Devices
member: Druck Incorporated
member: Ecomatik
member: Ecotech
member: EML
member: EMS Environmental Measuring Systems Brno
member: First Sensor
member: Fischer
member: Geonor
member: Gill Instruments
member: Hukseflux
member: IMKO
member: Intersema Sensoric SA
member: Jenoptik
member: Jodd Communications
member: KELLER Druckmesstechnik AG
member: Kipp & Zonen
member: Lambrecht Meteo
member: LI-COR
member: Los Gatos Research
member: LSI LASTEM
member: Met One Instruments
member: METEK Meteorologische Messtechnik GmbH
member: Meter Group
member: Microsonic
member: MicroStep-MIS
member: MIRO Analytical
member: MPS System
member: Nokeval
member: Observator instruments
member: Onset Computer Corporation
member: OTT
member: Pentronic
member: Picarro
member: Precis Mécanique
member: Pronamic
member: R. M. Young Company
member: RIMCO
member: Rotronic Instruments
member: SEBA Hydrometrie
member: Senseca Italy
member: Sentek Technologies
member: Setra Systems
member: SOMMER Messtechnik
member: Stevens Water Monitoring Systems
member: Texas Electronics
member: Texas Instruments
member: Thies Clima
member: Truebner
member: Vaisala
member: WeatherHawk
modified: 2025-07-07T19:57:16
member: Sunburst Sensors

WTD-Float
type: Collection
created: 2025-07-07T19:59:56
definition: Shortname used in BADM Standards for Water table depth, floating sensor
modified: 2025-07-22T19:19:14

WTD-Manual
type: Collection
created: 2025-07-07T20:12:11
definition: Shortname used in BADM Standards for Water table depth, manual system
modified: 2025-07-22T19:19:24

WTD-Other
type: Collection
created: 2025-07-07T20:13:18
definition: Shortname used in BADM Standards for Water table depth - Other
modified: 2025-07-22T19:19:32

GA_CP-Aerodyne
type: Collection
created: 2025-07-07T20:16:08
member: Aerodyne Dual QCL
member: Aerodyne Mini QCL
definition: Shortname used in BADM Standards for Gas Analyzer, Closed Path Fast Response, Aerodyne
modified: 2025-07-22T19:12:36

GA_CP-Campbell TGA100
type: Collection
created: 2025-07-07T20:17:03
definition: Shortname used in BADM Standards and ICOS BADM for Gas Analyzer, Closed Path, Campbell TGA100
member: Campbell Scientific TGA100A
modified: 2025-07-22T19:42:47

GA_CP-Campbell TGA200A
type: Collection
created: 2025-07-07T20:18:01
definition: Shortname used in BADM Standards and ICOS BADM for Gas Analyzer, Closed Path, Campbell TGA200A
member: Campbell Scientific TGA200A
modified: 2025-07-22T19:42:26

GA_CP-Campbell EC155
type: Collection
created: 2025-07-07T20:18:53
member: Campbell Scientific EC155
definition: Shortname used in BADM Standards and ICOS BADM for Gas Analyzer, Closed Path, Campbell EC155
modified: 2025-07-22T19:12:45

GA_CP-LGR RMT-200
type: Collection
created: 2025-07-07T20:22:52
definition: Shortname used in BADM Standards and ICOS BADM for Gas Analyzer, Closed Path, Los Gatos Research RMT-200
member: Los Gatos Research RMT-200
modified: 2025-07-26T17:40:51

GA_CP-LGR 911-0001
type: Collection
created: 2025-07-07T20:28:57
definition: Shortname used in BADM Standards for Gas Analyzer, Closed Path, Los Gatos Research 911-0001 for CH4/H2O
member: Los Gatos Research CH4-911 (former name FMA-911-0001)
modified: 2025-07-22T20:09:14

GA_CP-LGR 911-0010
type: Collection
created: 2025-07-07T20:29:43
definition: Shortname used in BADM Standards for Gas Analyzer, Closed Path, Los Gatos Research 911-0010 for CH4/CO2/H2O
member: Los Gatos Research GGA-911 (former name GGA-911-0010)
modified: 2025-07-22T20:21:04

GA_CP-LGR 911-0020
type: Collection
created: 2025-07-07T20:30:26
definition: Shortname used in BADM Standards for Gas Analyzer, Closed Path, Los Gatos Research 911-0020 for CO2/H2O
modified: 2025-07-22T19:13:36

GA_CP-LGR 913-0014
type: Collection
created: 2025-07-07T20:31:02
definition: Shortname used in BADM Standards for Gas Analyzer, Closed Path, Los Gatos Research 913-0014 for N2O/CO/H2O
member: Los Gatos Research N2OCM-913 (former name N2OCM-913-0014/0015)
modified: 2025-07-26T17:13:25

GA_CP-LGR 913-0029
type: Collection
created: 2025-07-07T20:31:35
definition: Shortname used in BADM Standards for Gas Analyzer, Closed Path, Los Gatos Research 913-0029 and 907-0029 for CO/CO2/H2O
member: Los Gatos Research CCQC-913 (former name CCQC-913-0025/0029)
modified: 2025-07-26T17:17:41

GA_CP-LGR 913-1054
type: Collection
created: 2025-07-07T20:32:26
definition: Shortname used in BADM Standards for Gas Analyzer, Closed Path, Los Gatos Research 913-1054 for N2O/CH4/H2O
member: Los Gatos Research N2OM1-913
modified: 2025-07-26T17:25:54

GA_CP-LGR 914-0028
type: Collection
created: 2025-07-07T20:33:31
definition: Shortname used in BADM Standards for Gas Analyzer, Closed Path, Los Gatos Research 914-0028 and 907-0028 for OCS/CO2/CO/H2O
member: Los Gatos Research OCS-914
modified: 2025-07-26T17:27:39

GA_CP-LGR 914-1012
type: Collection
created: 2025-07-07T20:34:21
definition: Shortname used in BADM Standards for Gas Analyzer, Closed Path, Los Gatos Research 914-1012 and 914-0012 for NH3/H2O
member: Los Gatos Research AAQC-914
modified: 2025-07-26T17:37:13

GA_CP-LGR Other
type: Collection
created: 2025-07-07T20:34:55
definition: Shortname used in BADM Standards for Gas Analyzer, Closed Path, Los Gatos Research Other Model
member: Los Gatos Research AMA-911 (former name MAA-911-0023)
member: Los Gatos Research CDA-907
member: Los Gatos Research FMA-907
member: Los Gatos Research GGA-907
member: Los Gatos Research M-GGA-918
member: Los Gatos Research M-GPC-918
member: Los Gatos Research MAA-907
member: Los Gatos Research MCEA1-911
member: Los Gatos Research MCEA1-927
member: Los Gatos Research N2OCM-916
member: Los Gatos Research N2OM1-916
member: Los Gatos Research NOCD-913 (former name NOA-913-0047)
member: Los Gatos Research NOCD-916 (former name NOA-916-0047)
member: Los Gatos Research OXCD-911 (former name OCO-911-0035)
member: Los Gatos Research U-MCEA1-915
member: Los Gatos Research CCQC-916
modified: 2025-07-26T18:13:00

GA_CP-LI-COR LI-6252
type: Collection
created: 2025-07-07T20:35:28
definition: Shortname used in BADM Standards and ICOS BADM for Gas Analyzer, Closed Path, LI-COR LI-6252
member: LI-COR LI-6252
modified: 2025-07-26T18:23:38

GA_CP-LI-COR LI-6262
type: Collection
created: 2025-07-07T20:36:24
definition: Shortname used in BADM Standards and ICOS BADM for Gas Analyzer, Closed Path, LI-COR LI-6262
member: LI-COR LI-6262
modified: 2025-07-26T18:23:56

GA_CP-LI-COR LI-7000
type: Collection
created: 2025-07-07T20:36:54
definition: Shortname used in BADM Standards and ICOS BADM for Gas Analyzer, Closed Path, LI-COR LI-7000
member: LI-COR LI-7000
modified: 2025-07-26T18:24:18

GA_CP-LI-COR LI-7200
type: Collection
created: 2025-07-07T20:37:26
definition: Shortname used in BADM Standards and ICOS BADM for Gas Analyzer, Closed Path, LI-COR LI-7200
member: LI-COR LI-7200
modified: 2025-07-26T18:24:54

GA_CP-LI-COR LI-7200RS
type: Collection
created: 2025-07-07T20:38:00
definition: Shortname used in BADM Standards and ICOS BADM for Gas Analyzer, Closed Path, LI-COR LI-7200RS
member: LI-COR LI-7200RS
modified: 2025-07-26T18:25:14

GA_CP-Picarro G1301-f
type: Collection
created: 2025-07-07T20:38:41
definition: Shortname used in BADM Standards and ICOS BADM for Gas Analyzer, Closed Path, Picarro G1301-f
member: Picarro G1301-f
modified: 2025-07-26T18:16:27

GA_CP-Picarro G2301-f
type: Collection
created: 2025-07-07T20:39:11
definition: Shortname used in BADM Standards and ICOS BADM for Gas Analyzer, Closed Path, Picarro G2301-f
member: Picarro G2301-f
modified: 2025-07-26T18:17:41

GA_CP-Picarro G2311-f
type: Collection
created: 2025-07-07T20:39:40
definition: Shortname used in BADM Standards and ICOS BADM for Gas Analyzer, Closed Path, Picarro G2311-f
member: Picarro G2311-f
modified: 2025-07-26T18:18:31

GA_CP-Picarro Other
type: Collection
created: 2025-07-07T20:40:45
definition: Shortname used in BADM Standards for Gas Analyzer, Closed Path, Picarro Other Model
modified: 2025-07-22T19:15:42

GA_OP-Campbell EC150
type: Collection
created: 2025-07-08T18:35:45
definition: Shortname used in BADM Standards and ICOS BADM for Gas Analyzer, Open Path, Campbell EC150
member: Campbell Scientific EC150
modified: 2025-07-26T18:35:41

GA_OP-LI-COR LI-7500
type: Collection
created: 2025-07-08T18:36:53
definition: Shortname used in BADM Standards and ICOS BADM for Gas Analyzer, Open Path, LI-COR LI-7500
member: LI-COR LI-7500
modified: 2025-07-26T18:41:47

GA_OP-LI-COR LI-7500A
type: Collection
created: 2025-07-08T18:37:20
definition: Shortname used in BADM Standards and ICOS BADM for Gas Analyzer, Open Path, LI-COR LI-7500A
member: LI-COR LI-7500A
modified: 2025-07-26T18:42:02

GA_OP-LI-COR LI-7500DS
type: Collection
created: 2025-07-08T18:37:55
definition: Shortname used in BADM Standards and ICOS BADM for Gas Analyzer, Open Path, LI-COR LI-7500DS
member: LI-COR LI-7500DS
modified: 2025-07-26T19:00:20

GA_OP-LI-COR LI-7500RS
type: Collection
created: 2025-07-08T18:38:30
definition: Shortname used in BADM Standards and ICOS BADM for Gas Analyzer, Open Path, LI-COR LI-7500RS
member: LI-COR LI-7500RS
modified: 2025-07-26T18:42:21

GA_OP-LI-COR LI-7700
type: Collection
created: 2025-07-08T18:39:40
definition: Shortname used in BADM Standards and ICOS BADM for Gas Analyzer, Open Path, LI-COR LI-7700
member: LI-COR LI-7700
modified: 2025-07-26T19:03:04

GA_OP-Krypton Hygrometer
type: Collection
created: 2025-07-08T18:40:10
definition: Shortname used in BADM Standards for Gas Analyzer, Open Path, Krypton Hygrometer
modified: 2025-07-22T19:16:22

GA_OP-Lyman-alpha Hygrometer
type: Collection
created: 2025-07-08T18:40:38
definition: Shortname used in BADM Standards for Gas Analyzer, Open Path, Lyman-alpha Hygrometer
modified: 2025-07-22T19:17:04

GA_OP-Other
type: Collection
created: 2025-07-08T18:41:20
definition: Shortname used in BADM Standards for Gas Analyzer, Open Path Fast Response - Other
modified: 2025-07-22T19:52:45

GA_SR-LI-COR LI-800
type: Collection
created: 2025-07-08T18:43:05
definition: Shortname used in BADM Standards and ICOS BADM for Gas Analyzer, Slow Response, LI-COR LI-800
member: LI-COR LI-800
modified: 2025-07-26T19:12:19

GA_SR-LI-COR LI-820
type: Collection
created: 2025-07-08T18:43:30
definition: Shortname used in BADM Standards and ICOS BADM for Gas Analyzer, Slow Response, LI-COR LI-820
member: LI-COR LI-820
modified: 2025-07-26T19:24:18

GA_SR-LI-COR LI-840
type: Collection
created: 2025-07-08T18:43:55
definition: Shortname used in BADM Standards and ICOS BADM for Gas Analyzer, Slow Response, LI-COR LI-840
member: LI-COR LI-840
modified: 2025-07-26T19:29:30

GA_SR-LI-COR LI-840A
type: Collection
created: 2025-07-08T18:44:19
definition: Shortname used in BADM Standards and ICOS BADM for Gas Analyzer, Slow Response, LI-COR LI-840A
modified: 2025-07-22T19:18:24

GA_SR-LI-COR LI-8100
type: Collection
created: 2025-07-08T18:44:43
definition: Shortname used in BADM Standards and ICOS BADM for Gas Analyzer, Slow Response, LI-COR LI-8100
member: LI-COR LI-8100
modified: 2025-07-26T19:16:16

GA_SR-LI-COR LI-8100A
type: Collection
created: 2025-07-08T18:45:08
definition: Shortname used in BADM Standards and ICOS BADM for Gas Analyzer, Slow Response, LI-COR LI-8100A
member: LI-COR LI-8100A
modified: 2025-07-26T19:20:10

GA_SR-Picarro G2401
type: Collection
created: 2025-07-08T18:46:39
definition: Shortname used in BADM Standards and ICOS BADM for Gas Analyzer, Slow Response, Picarro G2401
member: Picarro G2401
scope note: Picarro analyzers use time-based, optical absorption spectroscopy of the target gases to determine concentration in a sample. They are based on wavelength-scanned cavity ring-down spectroscopy (WS-CRDS), a technology in which light travels many times through the sample, creating a very long effective path length for the light to interact with the target gas, thus enabling excellent detection sensitivity in a compact and rugged instrument. The Picarro analyzer is comprised of two modules: -The Analyzer contains the spectrometer, sample chamber, and a computer with a hard drive to store and analyze data. The single analyzer module controls the operation of the system and converts spectroscopic measurements into gas concentration data. -TheExternal Vacuum Pumpdraws the sample gas through the instrument.
modified: 2025-07-26T19:45:28

GA_SR-Other
type: Collection
created: 2025-07-08T18:47:02
definition: Shortname used in BADM Standards for Gas Analyzer, Slow Response - Other
modified: 2025-07-22T19:18:49

GA_OP_SA-Campbell IRGASON
type: Collection
created: 2025-07-08T18:47:27
definition: Shortname used in BADM Standards and ICOS BADM for Gas Analyzer, Open Path with Sonic Anemometer, Campbell IRGASON
member: Campbell Scientific IRGASON
modified: 2025-07-26T18:36:42

GA_OP_SA-Other
type: Collection
created: 2025-07-08T18:48:24
definition: Shortname used in BADM Standards for Gas Analyzer, Open Path with Sonic Anemometer - Other
modified: 2025-07-22T19:15:57

GA_CP_SA-Other
type: Collection
created: 2025-07-08T18:49:03
definition: Shortname used in BADM Standards for Gas Analyzer, Closed Path with Sonic Anemometer - Other
modified: 2025-07-22T19:12:25

GA-Other
type: Collection
created: 2025-07-08T18:49:34
definition: Shortname used in BADM Standards for Gas Analyzer - Other
modified: 2025-07-22T19:19:06

GA_AIU-LI-COR LI-7550
type: Collection
created: 2025-07-08T18:56:46
member: LI-COR LI-7550 AIU
definition: Shortname used in BADM Standards and ICOS BADM for Auxiliar Interface Unit (AIU) of the Gas Analyzer, LI-COR, LI-7550
modified: 2025-07-22T19:12:12

GA_CP-Aerodyne DualQCL
type: Collection
created: 2025-07-08T18:57:19
member: Aerodyne Dual QCL
definition: Shortname used in ICOS BADM for Gas Analyzer (Closed Path - Dual laser), Aerodyne, DualQCL
modified: 2025-07-22T19:20:04

GA_CP-Aerodyne MiniQCL
type: Collection
created: 2025-07-08T18:57:52
member: Aerodyne Mini QCL
definition: Shortname used in ICOS BADM for Gas Analyzer (Closed Path - Single Laser), Aerodyne, MiniQCL
modified: 2025-07-22T19:20:11

GA_CP-LGR AAQC-914
type: Collection
created: 2025-07-08T19:20:45
definition: Shortname used in ICOS BADM for Gas Analyzer (Closed Path), Los Gatos Research, Enhanced Performance Trace Ammonia Analyzer (NH3, H2O) AAQC-914 (ref. code 914-0013-0000-0000)
member: Los Gatos Research AAQC-914
modified: 2025-07-26T17:36:48

GA_CP-LGR AMA-911
type: Collection
created: 2025-07-08T19:21:50
definition: Shortname used in ICOS BADM for Gas Analyzer (Closed Path), Los Gatos Research, Enhanced Performance Methane / Acetylene Analyzer (CH4, C2H2, H2O) AMA-911 (former name MAA-911-0023, ref. code 911-0023-0000-0000)
member: Los Gatos Research AMA-911 (former name MAA-911-0023)
modified: 2025-07-26T17:43:00

GA_CP-LGR CCQC-913
type: Collection
created: 2025-07-08T19:22:34
definition: Shortname used in ICOS BADM for Gas Analyzer (Closed Path), Los Gatos Research, Enhanced Performance Carbon Monoxide Analyzer (CO, CO2, H2O) CCQC-913 (former name CCQC-913-0025/0029, ref. code 913-0025-0000-0000, 913-0029-0000-0000)
member: Los Gatos Research CCQC-913 (former name CCQC-913-0025/0029)
modified: 2025-07-26T17:18:25

GA_CP-LGR CCQC-916
type: Collection
created: 2025-07-08T19:23:00
definition: Shortname used in ICOS BADM for Gas Analyzer (Closed Path), Los Gatos Research, Performance Carbon Monoxide / Carbon Dioxide Analyzer (CO, CO2, H2O) CCQC-916 (ref. code 916-0029-0000-0000)
member: Los Gatos Research CCQC-916
modified: 2025-07-26T17:47:14

GA_CP-LGR CDA-907
type: Collection
created: 2025-07-08T19:23:30
definition: Shortname used in ICOS BADM for Gas Analyzer (Closed Path), Los Gatos Research, Carbon Dioxide Analyzer (CO2, H2O) CDA-907-0002. Discontinued, replaced with CO2-911
member: Los Gatos Research CDA-907
modified: 2025-07-26T17:48:59

GA_CP-LGR CH4-911
type: Collection
created: 2025-07-08T19:23:54
definition: Shortname used in ICOS BADM for Gas Analyzer (Closed Path), Los Gatos Research, Enhanced Performance Fast Methane Analyzer (CH4, H2O) CH4-911 (former name FMA-911-0001, ref. code 911-0001-0000-0000)
member: Los Gatos Research CH4-911 (former name FMA-911-0001)
modified: 2025-07-22T20:08:41

GA_CP-LGR CO2-911
type: Collection
created: 2025-07-08T19:24:38
definition: Shortname used in ICOS BADM for Gas Analyzer (Closed Path), Los Gatos Research, Carbon Dioxide Analyzer (CO2, H2O) CO2-911 (former name CDA-911-0002)
modified: 2025-07-22T19:21:10

GA_CP-LGR FMA-907
type: Collection
created: 2025-07-08T19:25:07
definition: Shortname used in ICOS BADM for Gas Analyzer (Closed Path), Los Gatos Research, Fast Methane Analyzer (CH4, H2O) FMA-907-0001 (ref. code 907-0001-0000-0000). Discontinued, replaced with CH4-911
member: Los Gatos Research FMA-907
modified: 2025-07-26T17:50:05

GA_CP-LGR GGA-907
type: Collection
created: 2025-07-08T19:25:47
definition: Shortname used in ICOS BADM for Gas Analyzer (Closed Path), Los Gatos Research, Greenhouse Gas Analyzer (CH4, CO2, H2O) GGA-907-0010. Discontinued, replaced with GGA-911
member: Los Gatos Research GGA-907
modified: 2025-07-26T17:51:08

GA_CP-LGR GGA-911
type: Collection
created: 2025-07-08T19:26:14
definition: Shortname used in ICOS BADM for Gas Analyzer (Closed Path), Los Gatos Research, Enhanced Performance Greenhouse Gas Analyzer (CH4, CO2, H2O) GGA-911 (former name GGA-911-0010, ref. code 911-0011-0000-0000)
member: Los Gatos Research GGA-911 (former name GGA-911-0010)
modified: 2025-07-22T20:21:56

GA_CP-LGR M-GGA-918
type: Collection
created: 2025-07-08T19:26:45
definition: Shortname used in ICOS BADM for Gas Analyzer (Closed Path), Los Gatos Research, Greenhouse Gas Analyzers (CH4, CO2, H2O), Microportable 2 lasers, M-GGA-918 (ref. code 918-0011-0000-0000)
member: Los Gatos Research M-GGA-918
modified: 2025-07-26T17:52:13

GA_CP-LGR M-GPC-918
type: Collection
created: 2025-07-08T19:27:11
definition: Shortname used in ICOS BADM for Gas Analyzer (Closed Path), Los Gatos Research, Greenhouse Gas Analyzers (CH4, CO2, H2O), Microportable 1 laser, M-GPC-918 (ref. code 918-0001-0000-0000)
member: Los Gatos Research M-GPC-918
modified: 2025-07-26T17:53:14

GA_CP-LGR MAA-907
type: Collection
created: 2025-07-08T19:27:41
definition: Shortname used in ICOS BADM for Gas Analyzer (Closed Path), Los Gatos Research, Methane/Acetylene Analyzer (CH4, C2H2, H2O) MAA-907-0023 (ref.coed 907-0023-0000-0000). Discontinued, replaced with AMA-911
member: Los Gatos Research MAA-907
modified: 2025-07-26T17:54:04

GA_CP-LGR MCEA1-911
type: Collection
created: 2025-07-08T19:28:27
definition: Shortname used in ICOS BADM for Gas Analyzer (Closed Path), Los Gatos Research, Enhanced Performance Carbon Monoxide / Carbon Dioxide / Methane Analyzer (CH4, CO, CO2, H2O) MCEA-911 (ref. code 911-0059-0000-0000)
member: Los Gatos Research MCEA1-911
modified: 2025-07-26T17:54:53

GA_CP-LGR MCEA1-927
type: Collection
created: 2025-07-08T19:28:50
definition: Shortname used in ICOS BADM for Gas Analyzer (Closed Path), Los Gatos Research, Performance Carbon Monoxide / Carbon Dioxide / Methane Analyzer (CH4, CO, CO2, H2O) MCEA-927 (ref. code 927-0059-0000-0000)
member: Los Gatos Research MCEA1-927
modified: 2025-07-26T17:55:59

GA_CP-LGR N2OCM-913
type: Collection
created: 2025-07-08T19:29:20
definition: Shortname used in ICOS BADM for Gas Analyzer (Closed Path), Los Gatos Research, Enhanced Performance Nitrous Oxide / Carbon Monoxide Analyzer (N2O, CO, H2O) N2OCM-913 (former name N2OCM-913-0014/0015, ref. code 913-0015-0000-0000 )
member: Los Gatos Research N2OCM-913 (former name N2OCM-913-0014/0015)
modified: 2025-07-26T17:14:36

GA_CP-LGR N2OCM-916
type: Collection
created: 2025-07-08T19:29:44
definition: Shortname used in ICOS BADM for Gas Analyzer (Closed Path), Los Gatos Research, Performance Nitrous Oxide / Carbon Monoxide Analyzer (N2O, CO, H2O) N2OCM-916 (ref. code 916-0015-0000-0000)
member: Los Gatos Research N2OCM-916
modified: 2025-07-26T17:57:04

GA_CP-LGR N2OM1-913
type: Collection
created: 2025-07-08T19:30:20
definition: Shortname used in ICOS BADM for Gas Analyzer (Closed Path), Los Gatos Research, Enhanced Performance Methane / Nitrous Oxide Analyzer (CH4, N2O, H2O) N2OM1-913 (ref. codes 913-0055-0000-0000 / 913-1054-0000-0000 )
member: Los Gatos Research N2OM1-913
modified: 2025-07-26T17:26:36

GA_CP-LGR N2OM1-916
type: Collection
created: 2025-07-08T19:30:55
definition: Shortname used in ICOS BADM for Gas Analyzer (Closed Path), Los Gatos Research, Performance Methane / Nitrous Oxide Analyzer (CH4, N2O, H2O) N2OM1-916 (ref. code 916-0055-0000-0000)
member: Los Gatos Research N2OM1-916
modified: 2025-07-26T17:58:12

GA_CP-LGR NOCD-913
type: Collection
created: 2025-07-08T19:31:35
definition: Shortname used in ICOS BADM for Gas Analyzer (Closed Path), Los Gatos Research, Enhanced Performance Nitric Oxide / Carbon Dioxide Analyzer (NO, CO2, H2O) NOCD-913 (former name NOA-913-0047, ref. code 913-0047-0000-0000)
member: Los Gatos Research NOCD-913 (former name NOA-913-0047)
modified: 2025-07-26T17:59:22

GA_CP-LGR NOCD-916
type: Collection
created: 2025-07-08T19:31:58
definition: Shortname used in ICOS BADM for Gas Analyzer (Closed Path), Los Gatos Research, Performance Nitric Oxide / Carbon Dioxide Analyzer (NO, CO2, H2O) NOCD-916 (ref. code 916-0047-0000-0000)
member: Los Gatos Research NOCD-916 (former name NOA-916-0047)
modified: 2025-07-26T18:00:13

GA_CP-LGR OCS-914
type: Collection
created: 2025-07-08T19:32:22
member: Los Gatos Research OCS-914
definition: Shortname used in ICOS BADM for Gas Analyzer (Closed Path), Los Gatos Research, Enhanced Performance Carbonyl Sulfide Analyzer (OCS, CO2, CO, H2O) OCS-914 (ref. code 914-0028-0000-0000)
modified: 2025-07-26T17:30:33

GA_CP-LGR OXCD-911
type: Collection
created: 2025-07-08T19:32:47
definition: Shortname used in ICOS BADM for Gas Analyzer (Closed Path), Los Gatos Research, Enhanced Performance Oxygen / Carbon Dioxide Analyzer (O2, CO2, H2O) OXCD-911 (former name OCO-911-0035, ref. code 911-0035-0000-0000)
member: Los Gatos Research OXCD-911 (former name OCO-911-0035)
modified: 2025-07-26T18:01:11

GA_CP-LGR U-MCEA1-915
type: Collection
created: 2025-07-08T19:33:14
definition: Shortname used in ICOS BADM for Gas Analyzer (Closed Path), Los Gatos Research, Multi-gas Carbon Emissions Gas Analyzer, Ultraportable (CH4, CO, CO2, H2O) U-MCEA1-915 (ref. code 915-0059-0000-0000)
member: Los Gatos Research U-MCEA1-915
modified: 2025-07-26T18:02:06

GA_CP-MIRO MGAx-GHG
type: Collection
created: 2025-07-08T19:33:49
member: MIRO MGA3-GHG
member: MIRO MGA5-GHG
member: MIRO MGA6-GHG
member: MIRO MGA7-GHG
member: MIRO MGA8-GHG
definition: Shortname used in ICOS BADM for Gas Analyzer (Closed Path), MIRO, Multi-Compound Gas Analyzer MGA-GHG series (CH4, CO, CO2, H2O, N2O, NH3, O3, OCS), includes MGA8-GHG, MGA7-GHG, MGA6-GHG, MGA5-GHG, MGA3-GHG
modified: 2025-07-22T19:23:49

GA_CP-MIRO MGAx(x)-GP
type: Collection
created: 2025-07-08T19:34:15
definition: Shortname used in ICOS BADM for Gas Analyzer (Closed Path), MIRO, Multi-Compound Gas Analyzer MGA-GP series (CH4, CO, CO2, H2O, N2O, NH3, NO, NO2, O3, OCS), includes MGA10-GP, MGA9-GP
modified: 2025-07-22T19:23:56

GA_FLOW_CONTR-other
type: Collection
created: 2025-07-08T19:34:40
definition: Shortname used in ICOS BADM for Flow controller, non-LI-COR controller if LI-7200-101 is not used
member: Other models of flow controller for LI-7200
modified: 2025-07-26T18:32:04

GA_FM-LI-COR LI-7200-101
type: Collection
created: 2025-07-08T19:35:09
definition: Shortname used in ICOS BADM for Flow module, LI-COR, LI-7200-101
member: LI-COR LI-7200-101 Flow Module
modified: 2025-07-26T18:32:19

GA_FM-LI-COR LI-7200-102
type: Collection
created: 2025-07-08T19:35:36
definition: Shortname used in ICOS BADM for Flow module, LI-COR, LI-7200-102
member: LI-COR LI-7200-102 Flow Module
modified: 2025-07-26T18:32:47

GA_FM-other
type: Collection
created: 2025-07-08T19:36:04
definition: Shortname used in ICOS BADM for Flow module, non-LI-COR flow module if LI-7200-101 is not used
member: Other models of flow modules for LI-7200
modified: 2025-07-26T18:34:08

GA_PUMP-other
type: Collection
created: 2025-07-08T19:36:30
definition: Shortname used in ICOS BADM for Pump for GA, non-LI-COR pump if LI-7200-101 is not used
member: Other models of pumps for LI-7200
modified: 2025-07-26T19:07:45

GA_SR-LI-COR LI-830
type: Collection
created: 2025-07-08T19:36:54
definition: Shortname used in ICOS BADM for Gas Analyzer (Slow Response), LI-COR, LI-830
member: LI-COR LI-830
modified: 2025-07-26T19:27:00

GA_SR-LI-COR LI-850
type: Collection
created: 2025-07-08T19:37:21
definition: Shortname used in ICOS BADM for Gas Analyzer (Slow Response), LI-COR, LI-850
member: LI-COR LI-850
modified: 2025-07-26T19:37:56

GA_SR-LI-COR LI-870
type: Collection
created: 2025-07-08T19:37:45
definition: Shortname used in ICOS BADM for Gas Analyzer (Slow Response), LI-COR, LI-870
member: LI-COR LI-870
modified: 2025-07-26T19:39:49

GA_SR-Sunburst SAMI CO2
type: Collection
created: 2025-07-08T19:38:11
definition: Shortname used in ICOS BADM for Gas Analyzer (Slow Response), Sunburst Sensors, SAMI CO2 (pCO2 in water)
member: Sunburst Sensors SAMI CO2
modified: 2025-07-26T19:49:28

GA_SR-Vaisala GMP343
type: Collection
created: 2025-07-08T19:38:39
definition: Shortname used in ICOS BADM for Gas Analyzer (Slow Response), Vaisala, GMP343
member: Vaisala GMP343
modified: 2025-07-26T19:49:47

Auxiliar Interface Unit (AIU)
type: Concept
in scheme: icos_instruments
broader: gas analyzers
created: 2025-07-08T19:50:03

LI-COR LI-7550 AIU
type: Concept
in scheme: icos_instruments
broader: Auxiliar Interface Unit (AIU)
created: 2025-07-08T19:50:22
definition: Auxiliar Interface Unit (AIU) of the GA, LI-COR, LI-7550
modified: 2025-07-08T19:50:49

MIRO MGA3-GHG
type: Concept
in scheme: icos_instruments
created: 2025-07-08T20:20:23
definition: Gas Analyzer (Closed Path), MIRO, Multi-Compound Gas Analyzer MGA3-GHG
broader: Tunable Diode Laser Absorption Spectrometer (TDLAS)
modified: 2025-07-08T20:40:15

MIRO MGA5-GHG
type: Concept
in scheme: icos_instruments
created: 2025-07-08T20:20:48
definition: Gas Analyzer (Closed Path), MIRO, Multi-Compound Gas Analyzer MGA5-GHG
broader: Tunable Diode Laser Absorption Spectrometer (TDLAS)
modified: 2025-07-08T20:40:25

MIRO MGA6-GHG
type: Concept
in scheme: icos_instruments
created: 2025-07-08T20:21:01
definition: Gas Analyzer (Closed Path), MIRO, Multi-Compound Gas Analyzer MGA6-GHG
broader: Tunable Diode Laser Absorption Spectrometer (TDLAS)
modified: 2025-07-08T20:40:35

MIRO MGA7-GHG
type: Concept
in scheme: icos_instruments
created: 2025-07-08T20:21:14
definition: Gas Analyzer (Closed Path), MIRO, Multi-Compound Gas Analyzer MGA7-GHG
broader: Tunable Diode Laser Absorption Spectrometer (TDLAS)
modified: 2025-07-08T20:40:39

MIRO MGA8-GHG
type: Concept
in scheme: icos_instruments
created: 2025-07-08T20:21:23
definition: Gas Analyzer (Closed Path), MIRO, Multi-Compound Gas Analyzer MGA8-GHG
broader: Tunable Diode Laser Absorption Spectrometer (TDLAS)
modified: 2025-07-08T20:40:46

MIRO MGA10-GP
type: Concept
in scheme: icos_instruments
broader: Quantum Cascade Laser spectrometer (QCL)
created: 2025-07-22T19:45:37
scope note: MIRO's MGA-GP series analyzers directly measure concentrations of all compounds using mid-infrared laser absorption spectroscopy with Quantum Cascade Lasers as light sources.
modified: 2025-07-22T19:46:36

MIRO MGA9-GP
type: Concept
in scheme: icos_instruments
broader: Quantum Cascade Laser spectrometer (QCL)
created: 2025-07-22T19:45:47
scope note: MIRO's MGA-GP series analyzers directly measure concentrations of all compounds using mid-infrared laser absorption spectroscopy with Quantum Cascade Lasers as light sources.
modified: 2025-07-22T19:46:52

GA_CP-Other
type: Collection
created: 2025-07-22T19:53:02
definition: Shortname used in BADM Standards for Gas Analyzer, Closed Path Fast Response - Other
member: MIRO MGA3-GHG
member: MIRO MGA5-GHG
member: MIRO MGA6-GHG
member: MIRO MGA7-GHG
member: MIRO MGA8-GHG
member: MIRO MGA9-GP
member: MIRO MGA10-GP
member: LI-COR LI-830
modified: 2025-07-26T19:50:53
member: LI-COR LI-850
member: LI-COR LI-870
member: Sunburst Sensors SAMI CO2
member: Vaisala GMP343

Other models of flow modules for LI-7200
type: Concept
in scheme: icos_instruments
broader: Flow controller, module and pump
created: 2025-07-26T18:33:21
definition: Flow module, non-LI-COR flow module if LI-7200-101 is not used
modified: 2025-07-26T18:33:53

LI-COR LI-7500DS
type: Concept
in scheme: icos_instruments
broader: Open-path nondispersive infrared gas analyzer (NDIR)
created: 2025-07-26T18:58:35
scope note: The LI-7500DS is a high performance open-path CO2/H2O analyzer designed for use in eddy covariance flux measurement systems. It features simultaneous, high-speed measurements of CO2 and H2O in the free atmosphere. With the SmartFlux 3 System and a sonic anemometer, the instrument constitutes a complete eddy covariance system. This combination of instruments is used to measure the exchange of gas and energy between the terrestrial earth and the atmosphere using the eddy covariance method.
definition: Gas Analyzer (Open Path), LI-COR, LI-7500DS
modified: 2025-07-26T19:00:35

LI-COR LI-7700
type: Concept
in scheme: icos_instruments
broader: Open-path nondispersive infrared gas analyzer (NDIR)
created: 2025-07-26T19:01:03
definition: Gas Analyzer (Open Path), LI-COR, LI-7700
scope note: The LI-7700 is a high-speed, high-precision open path methane analyzer designed for use in eddy covariance flux and atmospheric monitoring applications. It uses Wavelength Modulation Spectroscopy (WMS) to make high-speed, precise measurements of methane concentrations at ambient pressure and temperature. It is designed to withstand environmental extremes expected during outdoor deployments.
modified: 2025-07-26T19:02:36

Other models of pumps for LI-7200
type: Concept
in scheme: icos_instruments
broader: Flow controller, module and pump
created: 2025-07-26T19:06:00
definition: Pump for GA, non-LI-COR pump if LI-7200-101 is not used
modified: 2025-07-26T19:07:06

Slow response gas analyzers
type: Concept
in scheme: icos_instruments
broader: gas analyzers
created: 2025-07-26T19:08:44

LI-COR LI-800
type: Concept
in scheme: icos_instruments
broader: Slow response gas analyzers
created: 2025-07-26T19:09:00
definition: Gas Analyzer (Slow Response), LI-COR, LI-800
scope note: The LI-800 is an economical high performance, non-dispersive infrared gas analyzer designed to be used for a wide variety of applications. Some of the LI-800's important features include: - Optional short (2") and standard long (5.5") interchangeable optical benches can be used to obtain resolutions of 0-20000 ppm and 0-2000 ppm, respectively. No changes in calibration polynomials or software need to be made when swapping optical benches. - Optical benches are fully serviceable by the user; cleaning the optical benches is a simple process, and does not affect the instrument calibration. - Simple Windows® software provides for easy user calibration and data output.
modified: 2025-07-26T19:11:55

LI-COR LI-8100
type: Concept
in scheme: icos_instruments
broader: Slow response gas analyzers
created: 2025-07-26T19:13:09
definition: Gas Analyzer (Slow Response), LI-COR, LI-8100
scope note: The LI-8100A is a fully automated system dedicated to making measurements of soil CO2 flux. The Analyzer Control Unit powers either a Survey or Long-Term measurement chamber, and houses the system electronics and the infrared gas analyzer (IRGA) used to measure the change in CO2 and H2O concentrations in the soil chamber. An Auxiliary Sensor Interface attaches to the Analyzer Control Unit to allow for connection of an external power source and your choice of sensors, such as soil temperature and/or soil moisture probes. Data collected by the LI-8100A can be stored to the instrument's flash memory, to an internal compact flash (CF) card, or transferred to a personal computer.
modified: 2025-07-26T19:15:49

LI-COR LI-8100A
type: Concept
in scheme: icos_instruments
broader: Slow response gas analyzers
created: 2025-07-26T19:16:37
definition: Gas Analyzer (Slow Response), LI-COR, LI-8100A
scope note: The LI-8100A is a fully automated system dedicated to making measurements of soil CO2 flux. The Analyzer Control Unit powers either a Survey or Long-Term measurement chamber, and houses the system electronics and the infrared gas analyzer (IRGA) used to measure the change in CO2 and H2O concentrations in the soil chamber. An Auxiliary Sensor Interface attaches to the Analyzer Control Unit to allow for connection of an external power source and your choice of sensors, such as soil temperature and/or soil moisture probes. Data collected by the LI-8100A can be stored to the instrument's flash memory, to an internal compact flash (CF) card, or transferred to a personal computer.
modified: 2025-07-26T19:19:51

LI-COR LI-820
type: Concept
in scheme: icos_instruments
broader: Slow response gas analyzers
created: 2025-07-26T19:20:31
definition: Gas Analyzer (Slow Response), LI-COR, LI-820
scope note: The LI-820 is an economical high performance, non-dispersive infrared gas analyzer designed to be used for a wide variety of applications. Some of the LI-820's important features include: - The 14 cm (5.5") optical bench is used to measure CO2 concentrations over a range of 0 - 20000 ppm. - The optical bench is fully serviceable by the user; cleaning the optical bench is a simple process, and does not affect the instrument calibration. - Simple Windows® software provides for easy user calibration and data output
modified: 2025-07-26T19:24:08

LI-COR LI-830
type: Concept
in scheme: icos_instruments
broader: Slow response gas analyzers
created: 2025-07-26T19:24:36
definition: Gas Analyzer (Slow Response), LI-COR, LI-830
scope note: The LI-830 measures CO2 in air at concentrations from 0 to 20.000 ppm.
modified: 2025-07-26T19:26:31

LI-COR LI-840
type: Concept
in scheme: icos_instruments
broader: Slow response gas analyzers
created: 2025-07-26T19:27:14
definition: Gas Analyzer (Slow Response), LI-COR, LI-840
scope note: The LI-840 is an economical, high performance, non-dispersive infrared gas analyzer designed to be used for a wide variety of applications. Some of the LI-840's important features include: - A 14 cm (5.5") optical bench is used to obtain a CO2 measurement range of 0-3000 ppm (parts per million, or μmol/mol) and an H2O measurement range of 0-80 ppt (parts per thousand, or mmol/mol). - The optical bench is fully serviceable by the user; cleaning the optical bench is a simple process, and does not affect the instrument's factory calibration. - Simple Windows® software provides for easy user calibration and data output.
modified: 2025-07-26T19:34:12

LI-COR LI-840A
type: Concept
in scheme: icos_instruments
broader: Slow response gas analyzers
created: 2025-07-26T19:30:23
definition: Gas Analyzer (Slow Response), LI-COR, LI-840A
scope note: The LI-840A is an economical, high performance, non-dispersive infrared gas analyzer designed to be used for a wide variety of applications. Some of the LI-840A's important features include: - A 14 cm (5.5") optical bench is used to obtain a CO2 measurement range of 0-20,000 ppm (parts per million, or µmol/mol) and an H2O measurement range of 0-60 mmol/mol. - The optical bench is fully serviceable by the user; cleaning the optical bench is a simple process, and does not affect the instrument's factory calibration. - Simple Windows® software provides for easy user calibration and data output.
modified: 2025-07-26T19:31:29

LI-COR LI-850
type: Concept
in scheme: icos_instruments
broader: Slow response gas analyzers
created: 2025-07-26T19:35:54
definition: Gas Analyzer (Slow Response), LI-COR, LI-850
scope note: LI-850 both measures CO2 in air at concentrations from 0 to 20.000 ppm. and water vapor in air as well,
modified: 2025-07-26T19:37:35

LI-COR LI-870
type: Concept
in scheme: icos_instruments
broader: Slow response gas analyzers
created: 2025-07-26T19:38:06
definition: Gas Analyzer (Slow Response), LI-COR, LI-870
scope note: The LI-870 is a CO2/H2O Gas Analyzer that is designed for use with the Smart Chamber and LI-8250 Multiplexer in soil gas flux systems. This document provides basic operating instructions for the LI-870. Refer to the Smart Chamber and LI-8250 manuals for additional information.
modified: 2025-07-26T19:39:30

Picarro G2401
type: Concept
in scheme: icos_instruments
broader: Slow response gas analyzers
created: 2025-07-26T19:40:07
definition: Gas Analyzer (Slow Response), Picarro, G2401
modified: 2025-07-26T19:40:28

Sunburst Sensors SAMI CO2
type: Concept
in scheme: icos_instruments
broader: Slow response gas analyzers
created: 2025-07-26T19:47:55
definition: Gas Analyzer (Slow Response), Sunburst Sensors, SAMI CO2 (pCO2 in water)
modified: 2025-07-26T19:48:14

Vaisala GMP343
type: Concept
in scheme: icos_instruments
broader: Slow response gas analyzers
created: 2025-07-26T19:48:40
definition: Gas Analyzer (Slow Response), Vaisala, GMP343
modified: 2025-07-26T19:48:58

Sunburst Sensors
type: Collection
created: 2025-07-26T19:53:27
member: Sunburst Sensors SAMI CO2
modified: 2025-07-26T19:54:09

Bosch BMP series
type: Concept
in scheme: icos_instruments
broader: Electronic barometer
created: 2025-07-26T19:59:22
definition: Atmospheric Pressure, Bosch, BMP series (includes BMP280, BMP380, BMP384, BMP388, BMP390, BMP580, BMP581)
modified: 2025-07-26T20:01:36

PRES-Bosch BMPxxx
type: Collection
created: 2025-07-26T20:05:24
member: Bosch BMP series
member: Bosch BMP280
member: Bosch BMP380
member: Bosch BMP384
member: Bosch BMP388
member: Bosch BMP390
member: Bosch BMP580
member: Bosch BMP581
definition: Shortname used in ICOS BADM for Atmospheric Pressure, Bosch, BMP series (includes BMP280, BMP380, BMP384, BMP388, BMP390, BMP580, BMP581)
modified: 2025-07-26T20:07:02

PRES-ElectBar
type: Collection
created: 2025-07-26T20:06:02
member: Bosch BMP series
member: Bosch BMP280
member: Bosch BMP380
member: Bosch BMP384
member: Bosch BMP388
member: Bosch BMP390
member: Bosch BMP580
member: Bosch BMP581
definition: Shortname used in BADM Standards for Electronic barometer
member: Campbell Scientific BaroVUE 10
member: Campbell Scientific ClimaVUE 50 Pressure component
member: CRESSTO SPA series
member: Druck DPI 26x series
member: Druck DPI 260
member: Druck DPI 261
member: Druck DPI 262
member: Druck DPI 265
member: Druck DPI 266
member: Druck DPI 267
member: Delta Ohm HD9408T BARO
member: Delta Ohm HD9408TR BARO
member: Delta Ohm HD9908T BARO
member: Druck RPT410F
member: First Sensor 144SC0811BARO
member: First Sensor 144SC1216BARO
member: Keller PAA33x
member: Setra 270 (and CS equivalent)
member: Setra 278 (and CS or Thies equivalent)
member: Vaisala PMT16A
member: Vaisala PTB100 series
member: Vaisala PTB100A
member: Vaisala PTB100B
member: Vaisala PTB101B
member: Vaisala PTB101C
member: Vaisala PTB110 (or CS equivalent)
member: Vaisala PTB210
member: Vaisala PTB330
member: WeatherHawk WeatherHawk 610 Pressure component
member: Young 61302
modified: 2026-02-06T13:37:04

PRES-Campbell BaroVUE10
type: Collection
created: 2025-07-26T20:10:14
definition: Shortname used in ICOS BADM for Atmospheric Pressure, Campbell Scientific, BaroVUE 10
member: Campbell Scientific BaroVUE 10
modified: 2025-07-26T20:10:45

Campbell Scientific ClimaVUE 50 Pressure component
type: Concept
in scheme: icos_instruments
broader: Electronic barometer
created: 2025-07-26T20:12:07
definition: Atmospheric Pressure, Campbell Scientific, ClimaVUE 50 weather station (air pressure sensor)
modified: 2025-07-26T20:12:41

PRES-Campbell ClimaVUE50
type: Collection
created: 2025-07-26T20:13:58
definition: Shortname used in ICOS BADM for Atmospheric Pressure, Campbell Scientific, ClimaVUE 50 weather station (air pressure sensor)
member: Campbell Scientific ClimaVUE 50 Pressure component
modified: 2025-07-26T20:14:39

PRES-CRESSTO SPA5x(x)
type: Collection
created: 2025-07-26T20:21:05
definition: Shortname used in ICOS BADM for Atmospheric Pressure, CRESSTO, SPA series (includes all the allowed combinations of letters and ciphers in the product code relative to multiplicand (1|3), accuracy (1|2), pressure connection (R|V|N|M|O|B), electrical connection (2|5), analogue electrical output (U), digital electrical output (A|B|C|[none]), display (D|[none]), memory (M|[none]), switch (S|[none]))
member: CRESSTO SPA series
modified: 2025-07-26T20:21:52

Druck DPI 26x series
type: Concept
in scheme: icos_instruments
broader: Electronic barometer
created: 2026-02-06T11:57:49
definition: Atmospheric Pressure, GE Druck, DPI 260 series
modified: 2026-02-06T12:44:22

PRES-Druck DPI 26x
type: Collection
created: 2026-02-06T12:17:21
member: Druck DPI 26x series
member: Druck DPI 260
member: Druck DPI 261
member: Druck DPI 262
member: Druck DPI 265
member: Druck DPI 266
member: Druck DPI 267
definition: Shortname used in ICOS BADM for Atmospheric Pressure, GE Druck, DPI 260 series
modified: 2026-02-06T12:20:19

Delta Ohm HD9408TR BARO
type: Concept
in scheme: icos_instruments
broader: Electronic barometer
created: 2026-02-06T12:29:15
definition: Atmospheric pressure, DeltaOhm, HD9X08T(R)
modified: 2026-02-06T12:31:45

Delta Ohm HD9908T BARO
type: Concept
in scheme: icos_instruments
broader: Electronic barometer
created: 2026-02-06T12:29:41
definition: Atmospheric pressure, DeltaOhm, HD9X08T(R)
modified: 2026-02-06T12:31:09

PRES-DeltaOhm HD9X08T(R)
type: Collection
created: 2026-02-06T12:32:48
definition: Shortname used in ICOS BADM for Atmospheric pressure, DeltaOhm, HD9X08T(R) (includes HD9408T BARO, HD9408TR BARO and HD9908T BARO)
member: Delta Ohm HD9408T BARO
modified: 2026-02-06T12:34:21
member: Delta Ohm HD9408TR BARO
member: Delta Ohm HD9908T BARO

PRES-Druck RPT410F
type: Collection
created: 2026-02-06T12:50:02
member: Druck RPT410F
definition: Shortname used in ICOS BADM for Atmospheric Pressure, GE Druck, RPT410F (also named CS115)
modified: 2026-02-06T12:51:22

First Sensor 144SC1216BARO
type: Concept
in scheme: icos_instruments
broader: Electronic barometer
created: 2026-02-06T12:56:48

PRES-FirstSensor 144SCxxxxBARO
type: Collection
created: 2026-02-06T13:02:24
definition: Shortname used in ICOS BADM for Atmospheric Pressure, First Sensor, 144SCxxxxBARO sensors (includes 144SC0811BARO and 144SC1216BARO)
member: First Sensor 144SC0811BARO
modified: 2026-02-06T13:04:01
member: First Sensor 144SC1216BARO

PRES-Keller PAA33x
type: Collection
created: 2026-02-06T13:46:18
definition: Shortname used in ICOS BADM for Atmospheric Pressure, Keller, PAA-33X
member: Keller PAA33x
modified: 2026-02-06T13:48:47

PRES-Setra 270
type: Collection
created: 2026-02-06T13:49:47
definition: Shortname used in ICOS BADM for Atmospheric Pressure, Setra, 270 (also named SBP270 from Campbell)
member: Setra 270 (and CS equivalent)
modified: 2026-02-06T13:50:42

PRES-Setra 278
type: Collection
created: 2026-02-06T13:51:20
definition: Shortname used in ICOS BADM for Atmospheric Pressure, Setra, 278 (also named CS100 or Thies B-278-2T)
member: Setra 278 (and CS or Thies equivalent)
modified: 2026-02-06T13:52:58

PRES-Vaisala PMT16A
type: Collection
created: 2026-02-06T13:53:23
definition: Shortname used in ICOS BADM for Atmospheric Pressure, Vaisala, PMT16A
member: Vaisala PMT16A
modified: 2026-02-06T13:54:55

PRES-Vaisala PTB10X(X)
type: Collection
created: 2026-02-06T13:55:33
member: Vaisala PTB100 series
definition: Shortname used in ICOS BADM for Atmospheric Pressure, Vaisala, PTB100 series (includes PTB100A, PTB100B, PTB101C and PTB101B. The latter is also named CS105 by Campbell Scientific)
member: Vaisala PTB100A
member: Vaisala PTB100B
modified: 2026-02-06T14:26:56
member: Vaisala PTB101B
member: Vaisala PTB101C

PRES-Vaisala PTB110
type: Collection
created: 2026-02-06T13:57:54
definition: Shortname used in ICOS BADM for Atmospheric Pressure, Vaisala, PTB110 (also named CS106)
member: Vaisala PTB110 (or CS equivalent)
modified: 2026-02-06T13:59:11

PRES-Vaisala PTB210
type: Collection
created: 2026-02-06T14:01:56
definition: Shortname used in ICOS BADM for Atmospheric Pressure, Vaisala, PTB210
member: Vaisala PTB210
modified: 2026-02-06T14:03:13

PRES-WeatherHawk 610
type: Collection
created: 2026-02-06T14:28:00
definition: Shortname used in ICOS BADM for Atmospheric Pressure, WeatherHawk, 610 weather station (air pressure sensor)
member: WeatherHawk WeatherHawk 610 Pressure component
modified: 2026-02-06T14:29:30

PRES-Young 61302
type: Collection
created: 2026-02-06T14:30:21
definition: Shortname used in ICOS BADM for Atmospheric Pressure, Young, 61302 series
member: Young 61302
modified: 2026-02-06T14:31:40

Other technology barometer
type: Concept
in scheme: icos_instruments
broader: barometer
created: 2026-02-06T14:37:36

PRES-Other
type: Collection
created: 2026-02-06T14:41:38
definition: Shortname used in BADM Standards for Atmospheric Pressure - Other
member: Campbell Scientific ClimaVUE 50 Pressure component
member: Gill MaxiMet GMXxxx series Pressure component
member: Gill MaxiMet GMX100 series Pressure component
member: Gill MaxiMet GMX200 series Pressure component
member: Gill MaxiMet GMX300 series Pressure component
member: Gill MaxiMet GMX301 series Pressure component
member: Gill MaxiMet GMX400 series Pressure component
member: Gill MaxiMet GMX500 series Pressure component
member: Gill MaxiMet GMX501 series Pressure component
member: Gill MaxiMet GMX531 series Pressure component
member: Gill MaxiMet GMX551 series Pressure component
member: Gill MaxiMet GMX600 series Pressure component
modified: 2026-02-06T14:43:52

PRES-Gill MaxiMet GMXxxx
type: Collection
created: 2026-02-06T14:44:47
definition: Shortname used in ICOS BADM for Atmospheric pressure, Gill, MaxiMet GMXxxx weather station (Pressure sensor. Includes GMX100, GMX300, GMX301, GMX400, GMX200, GMX500, GMX501, GMX531, GMX551, GMX600)
member: Gill MaxiMet GMXxxx series Pressure component
member: Gill MaxiMet GMX100 series Pressure component
member: Gill MaxiMet GMX200 series Pressure component
member: Gill MaxiMet GMX300 series Pressure component
member: Gill MaxiMet GMX301 series Pressure component
member: Gill MaxiMet GMX400 series Pressure component
member: Gill MaxiMet GMX500 series Pressure component
member: Gill MaxiMet GMX501 series Pressure component
member: Gill MaxiMet GMX531 series Pressure component
modified: 2026-02-06T14:46:03
member: Gill MaxiMet GMX551 series Pressure component
member: Gill MaxiMet GMX600 series Pressure component

PRESRHTEMP-Bosch BME280
type: Collection
created: 2026-02-06T15:57:37
definition: Shortname used in ICOS BADM for Atmospheric Pressure, Air Relative Humidity and Temperature, Bosch, BME280
member: Bosch BME280
modified: 2026-02-06T15:59:18

MULTI-Meteo
type: Collection
created: 2026-02-06T16:00:52
definition: Shortname used in BADM Standards for Multi-measurement meteorological
member: Bosch BME280
member: Vaisala PTU(x) series
member: Vaisala PTU300 pressure, humidity and temperature transmitter series
member: Vaisala PTU301 pressure, humidity and temperature transmitter series
member: Vaisala PTU303 pressure, humidity and temperature transmitter series
member: Vaisala PTU307 pressure, humidity and temperature transmitter series
modified: 2026-02-06T16:20:14
member: Vaisala Weather Transmitter WXT530
member: Vaisala Weather Transmitter WXT520
member: Vaisala PTU-Module on WXT520 and WXT530 series Weather Transmitter (excluding PTU30T)

PRESRHTEMP-Vaisala PTU(x)
type: Collection
created: 2026-02-06T16:16:38
definition: Shortname used in ICOS BADM for Atmospheric Pressure, Air Relative Humidity and Temperature, Vaisala, PTU(x) (includes PTU300, PTU301, PTU303, PTU307 and PTU-Module on WXT520 and WXT530 series Weather Transmitter)
member: Vaisala PTU(x) series
member: Vaisala PTU300 pressure, humidity and temperature transmitter series
member: Vaisala PTU301 pressure, humidity and temperature transmitter series
member: Vaisala PTU303 pressure, humidity and temperature transmitter series
member: Vaisala PTU307 pressure, humidity and temperature transmitter series
member: Vaisala PTU-Module on WXT520 and WXT530 series Weather Transmitter (excluding PTU30T)
member: Vaisala Weather Transmitter WXT520
member: Vaisala Weather Transmitter WXT530
modified: 2026-02-06T16:18:55

Optical precipitation gauge
type: Concept
in scheme: icos_instruments
broader: precipitation sensor
created: 2026-02-06T19:12:14

PREC-Gill MaxiMet GMXxxx
type: Collection
created: 2026-02-06T19:14:06
definition: Shortname used in ICOS BADM for Rain (optical gauge), Gill, MaxiMet GMXxxx weather station (Precipitation sensor. Includes GMX100, GMX300, GMX301, GMX400, GMX200, GMX500, GMX501, GMX531, GMX551, GMX600)
member: Gill MaxiMet GMXxxx series Rain component
member: Gill MaxiMet GMX100 series Rain component
member: Gill MaxiMet GMX200 series Rain component
member: Gill MaxiMet GMX300 series Rain component
member: Gill MaxiMet GMX301 series Rain component
member: Gill MaxiMet GMX400 series Rain component
member: Gill MaxiMet GMX500 series Rain component
modified: 2026-02-06T19:15:30
member: Gill MaxiMet GMX501 series Rain component
member: Gill MaxiMet GMX531 series Rain component
member: Gill MaxiMet GMX551 series Rain component
member: Gill MaxiMet GMX600 series Rain component

PREC-OpticGauge
type: Collection
created: 2026-02-06T19:15:57
member: Gill MaxiMet GMXxxx series Rain component
member: Gill MaxiMet GMX100 series Rain component
member: Gill MaxiMet GMX200 series Rain component
member: Gill MaxiMet GMX300 series Rain component
member: Gill MaxiMet GMX301 series Rain component
member: Gill MaxiMet GMX400 series Rain component
member: Gill MaxiMet GMX500 series Rain component
member: Gill MaxiMet GMX501 series Rain component
member: Gill MaxiMet GMX531 series Rain component
member: Gill MaxiMet GMX551 series Rain component
member: Gill MaxiMet GMX600 series Rain component
definition: Shortname used in BADM Standards for Optical precipitation gauge (measuring rain and snow)
member: Thies Clima 5.4110 series
member: Vaisala FD12P
modified: 2026-02-06T19:25:47

PREC-Thies 54110
type: Collection
created: 2026-02-06T19:21:17
definition: Shortname used in ICOS BADM for Precipitation (optical gauge), Thies, Laser-Niederschlags-Monitor, 54110 series
member: Thies Clima 5.4110 series
modified: 2026-02-06T19:22:10

PREC-Vaisala FD12P
type: Collection
created: 2026-02-06T19:24:34
definition: Shortname used in ICOS BADM for Precipitation (optical gauge), Vaisala, FD12P
member: Vaisala FD12P
modified: 2026-02-06T19:25:18

Tipping bucket precipitation gauge
type: Concept
in scheme: icos_instruments
broader: precipitation sensor
created: 2026-02-06T19:27:19

PREC-AMET TippingBucket
type: Collection
created: 2026-02-06T19:29:26
definition: Shortname used in ICOS BADM for Rain (tipping bucket gauge), AMET, generic model
member: AMET Tipping Bucket
modified: 2026-02-06T19:30:20

PREC-TipBucGauge
type: Collection
created: 2026-02-06T19:30:41
definition: Shortname used in BADM Standards for Tipping bucket precipitation gauge (measuring rain and snow)
member: AMET Tipping Bucket
member: Pronamic Rain-O-Matic 400.042 - XX
modified: 2026-02-06T19:35:06
member: Pronamic Rain-O-Matic 400.042-10
member: Pronamic Rain-O-Matic 400.042-25
member: Pronamic Rain-O-Matic 400.042-50

PREC-Pronamic 400.042-XX
type: Collection
created: 2026-02-06T19:33:50
definition: Term/Shortname used in ICOS BADM for Precipitation (tipping bucket gauge), Pronamic, Rain-O-Matic 400.042 - XX series (includes 400.042 - 10, 400.042 - 20, 400.042 - 25, 400.042 - 50. Also named Rain-O-Matic Meteorological Snow & Rain)
member: Pronamic Rain-O-Matic 400.042 - XX
member: Pronamic Rain-O-Matic 400.042-10
member: Pronamic Rain-O-Matic 400.042-25
member: Pronamic Rain-O-Matic 400.042-50
modified: 2026-02-06T19:34:34